program: Gaussian 09
title: 000189603
version: EM64L-G09RevD.01
frameworkgroup: C1[X(C20H23NO4)]
method: RPBEPBE
basis: SDD
operation: Freq
keyword: #p
keyword: freq=noraman
keyword: PBEPBE/SDD
title: #p freq=noraman PBEPBE/SDD
converged: YES YES NO NO
title: Mulliken charges:
elementType: O O O O N C C C C C C C C C C C C C C C C C C C C H H H H H H H H H H H H H H H H H H H H H H H
charge: -0.257133 -0.406989 -0.294906 -0.442891 -0.110475 -0.158999 0.100171 -0.696203 0.224108 -0.407465 0.265221 -0.519744 0.431616 -0.022197 -0.016822 0.034985 -0.641674 0.011654 -0.509886 0.100648 -0.216544 -0.375991 -0.495252 -0.513282 -0.520405 0.213459 0.225883 0.243745 0.214732 0.191079 0.243183 0.235472 0.226479 0.189736 0.226616 0.236923 0.224636 0.249690 0.399381 0.252451 0.228406 0.203676 0.258697 0.233268 0.242667 0.258442 0.229095 0.210739
chargesum: 0.00000
title: Mulliken charges with hydrogens summed into heavy atoms:
elementType: O O O O N C C C C C C C C C C C C C C C C C C C C
charge: -0.257133 -0.406989 -0.294906 -0.043510 -0.110475 0.054460 0.100171 -0.226575 0.224108 -0.001653 0.265221 -0.041088 0.431616 -0.022197 -0.016822 0.034985 0.001157 0.011654 -0.272964 0.100648 0.008092 -0.126302 0.189281 0.221350 0.177872
polarizability: 3.32104362e+02 1.09129721e+01 2.72302677e+02 -3.08020789e+00 9.72109102e+00 1.40706310e+02
1716.lowfreq: -9.8029 -7.7092 -6.3404 -0.0005 -0.0004 0.0002 27.4386 45.5406 48.5666
frequency: 27.3246 45.4640 48.5090 70.5204 83.1419 97.4730 107.9528 124.5136 131.6886 156.4190 165.5133 174.7434 187.4500 200.9957 207.1064 224.7378 231.4960 238.4447 252.3217 276.0845 298.9955 301.2121 312.6598 337.2927 344.0612 361.2396 381.9931 411.6195 426.8042 434.8594 464.3386 477.7113 503.7074 506.6277 531.2806 543.1538 557.0032 574.5753 600.4177 604.4735 659.7050 681.3798 719.1453 733.9936 750.3943 771.6944 788.0200 798.7149 818.0226 834.4549 883.4651 886.6308 899.2599 905.9244 926.7388 963.0921 969.1980 972.4046 987.4019 1014.0290 1031.3416 1044.5639 1070.5792 1073.3312 1084.9276 1097.2487 1108.0135 1110.4388 1113.0363 1118.3420 1134.0728 1150.4899 1154.4304 1157.7108 1159.6469 1164.8595 1169.1184 1203.0386 1220.8756 1226.0892 1228.9315 1250.6369 1270.6591 1285.8432 1296.9170 1312.3005 1331.3481 1338.0384 1356.4193 1365.6921 1377.1088 1388.7209 1402.0219 1411.4371 1430.5009 1432.9318 1435.7626 1442.2500 1450.2741 1454.3505 1454.9767 1458.2829 1458.4860 1459.2744 1468.6420 1472.0304 1473.8798 1479.0193 1481.6247 1482.7085 1484.1116 1556.4618 1578.7003 1594.7803 1615.5819 2786.1996 2841.9595 2861.2845 2967.9928 2978.4141 2983.9466 2987.5411 2991.6714 3033.7193 3035.9281 3038.2208 3049.0488 3069.8064 3074.8888 3088.6784 3090.0272 3098.4144 3120.8061 3124.6123 3126.4572 3130.2404 3145.4098 3170.6116
redmass: 3.3178 3.6603 2.9792 3.4220 4.3565 3.6928 3.9639 3.6685 1.4544 1.6895 1.0795 1.5632 3.7943 2.8670 1.8682 1.3866 3.9272 2.8827 2.6874 4.5234 5.0928 3.5515 5.6710 4.4487 3.0750 4.2888 6.2793 5.0474 4.3049 3.9954 3.8301 4.9940 3.2655 5.6392 4.0465 6.8190 4.0878 4.0981 4.4739 4.7010 5.9465 5.6187 3.7487 5.6562 4.1743 3.5903 1.6349 5.6573 5.0784 3.0324 1.4708 4.3041 1.8367 2.0168 2.9293 2.7756 1.3813 5.8624 2.5684 3.3220 2.7542 3.6157 2.4242 2.5819 2.0253 2.8956 1.2606 1.2473 1.4330 1.2627 2.1517 1.9655 1.4164 1.4454 1.6045 1.4914 1.1950 1.5939 1.8659 2.2294 1.9261 1.7994 2.1117 4.1897 1.7981 1.5997 1.9062 1.8664 3.2801 2.1687 2.0144 2.0757 1.8223 2.2184 1.3430 1.3776 1.3493 1.3813 1.8230 1.4374 1.1194 1.1902 1.1603 1.0736 1.0794 1.0580 1.0497 1.0789 1.2187 1.0894 1.6573 8.7036 6.6693 9.0004 5.9448 1.0778 1.0694 1.0589 1.0341 1.0346 1.0649 1.0300 1.0630 1.0778 1.0827 1.0663 1.0978 1.0962 1.0981 1.0966 1.0991 1.1058 1.1042 1.0867 1.1056 1.1047 1.0931 1.0974
irintensity: 2.8026 1.9701 3.3343 1.9767 0.8561 6.2588 3.3061 0.4585 1.8098 2.2885 0.1222 0.8048 1.9547 1.6809 1.4478 0.7694 0.6345 2.2536 1.6663 7.3326 6.8973 3.5165 7.3839 7.9055 2.9586 7.1949 5.7480 0.9578 0.9517 4.1987 4.2525 1.8060 3.6622 6.3448 1.0992 3.1300 6.1380 5.1522 0.3349 5.8926 7.0146 5.6451 6.4580 29.6412 24.2724 1.8226 41.8840 1.6276 23.3803 13.9513 2.9646 6.2027 7.8438 63.7540 5.2902 30.8133 5.9445 133.1749 12.4653 21.4032 23.9595 81.2048 31.1803 18.0390 32.9603 23.8268 9.1842 2.2118 15.8733 3.1034 17.1948 3.3764 13.0527 0.1888 12.4932 15.7888 1.4366 13.3460 67.7663 9.3165 3.9743 48.9807 31.2900 5.1632 2.2513 20.9769 94.9718 59.7187 12.7559 96.8230 28.4353 84.8443 54.9575 3.5520 34.4769 17.8289 0.5391 26.6745 54.6084 11.4054 12.1558 24.3459 19.2935 5.4709 5.3386 7.5101 21.9195 20.0849 7.5457 32.7588 7.9745 39.2409 50.1213 16.0518 36.3845 40.9837 57.5958 177.5990 82.4010 101.1694 17.1265 80.6422 14.7088 17.0691 85.1674 526.3190 18.7322 36.1311 28.5592 43.2123 32.3269 18.0924 19.6739 6.0903 18.1634 14.3716 23.1707 21.8205
temp: 298.150 k
press: 1.00000 atm
elementType: 8 8 8 8 7 6 6 6 6 6 6 6 6 6 6 6 6 6 6 6 6 6 6 6 6 1 1 1 1 1 1 1 1 1 1 1 1 1 1 1 1 1 1 1 1 1 1 1
symmnumber: 1
zpe: 1023754.2 jmol-1
zpe.correction: 0.389927 hartree
zpe.thermalcorrener: 0.413369 hartree
zpe.thermalcorrenthalpy: 0.414313 hartree
zpe.thermalcorrgfe: 0.338083 hartree
zpe.sumelectzpe: -1129.683878 hartree
zpe.sumelectthermal: -1129.660437 hartree
zpe.sumelectthermalent: -1129.659492 hartree
zpe.sumelectthermalfe: -1129.735722 hartree
dipole: 2.8770 0.4930 0.4945
dipole: 2.9605
quadrupole: -129.9545 -138.1082 -150.1525
quadrupole: -12.2124 -8.2477 -9.0430
quadrupole: 9.4506 1.2969 -10.7474 -12.2124 -8.2477 -9.0430
hfenergy: -1130.073805 hartree
pointgroup: C01 [X(C20H23N1O4)]
dipole: -1.1330096 -0.0632637 -0.2625226 debye
polarizability: 333.276639|3.8409415|270.9315055|10.5565341|-7.1630852|140.9052046 unknown
InChI: InChI=1S/C20H23NO4/c1-21-9-8-12-16-13(21)10-11-6-5-7-14(22)15(11)17(16)19(24-3)20(25-4)18(12)23-2/h5-7,13,22H,8-10H2,1-4H3
charge 0 multiplicity 1
48 atoms
O  -3.903837 0.486519 -0.404329
O  -0.111329 -2.656996 -0.36312
O  -2.823125 -2.275953 -0.638485
O  1.861109 -2.638432 1.218848
N  0.017276 3.561249 -0.148272
C  0.668657 2.260615 0.150689
C  -0.286732 1.068435 0.022723
C  1.862895 1.975768 -0.791389
C  -1.677135 1.261418 -0.100118
C  -1.296117 3.670273 0.532137
C  0.300713 -0.246916 -0.009384
C  -2.278517 2.65349 -0.057453
C  2.580928 0.731374 -0.301283
C  1.786217 -0.388107 0.117962
C  -2.553158 0.144891 -0.260416
C  -0.600727 -1.320748 -0.215651
C  0.885141 4.713411 0.177286
C  -2.007303 -1.160576 -0.325773
C  3.985459 0.716784 -0.196246
C  2.481908 -1.51216 0.688553
C  4.648929 -0.40713 0.349964
C  3.897252 -1.505663 0.795316
C  -4.971079 -0.495913 -0.150012
C  0.092747 -3.082234 -1.769171
C  -2.942856 -3.294941 0.430057
H  1.068731 2.266125 1.203501
H  2.568802 2.822225 -0.807362
H  1.464893 1.852505 -1.818385
H  -1.682105 4.694584 0.379405
H  -1.200281 3.512225 1.638165
H  -2.557931 2.963436 -1.08275
H  -3.21707 2.634625 0.525682
H  1.798392 4.707833 -0.440164
H  1.194428 4.737931 1.25336
H  0.34066 5.647716 -0.045261
H  4.557517 1.591138 -0.526434
H  5.741039 -0.41916 0.436865
H  4.369545 -2.387107 1.239052
H  0.989783 -2.813827 0.722139
H  -4.986719 -1.277931 -0.924387
H  -5.898335 0.097912 -0.171403
H  -4.85028 -0.961978 0.846699
H  -0.880791 -3.0820 -2.287368
H  0.507415 -4.100419 -1.718874
H  0.805389 -2.401087 -2.267386
H  -1.951064 -3.700466 0.691431
H  -3.582093 -4.086532 0.009305
H  -3.423139 -2.858506 1.327836
