program: Gaussian 09
title: 000189577
version: EM64L-G09RevD.01
frameworkgroup: C1[X(C19H25NO2)]
method: RPBEPBE
basis: SDD
operation: Freq
keyword: #p
keyword: freq=noraman
keyword: PBEPBE/SDD
title: #p freq=noraman PBEPBE/SDD
converged: YES YES NO NO
title: Mulliken charges:
elementType: O O N C C C C C C C C C C C C C C C C C C C H H H H H H H H H H H H H H H H H H H H H H H H H
charge: -0.280871 -0.281613 -0.050990 0.318756 -0.595735 -0.722862 -0.723098 -0.716885 0.496844 -0.379105 -0.411813 -0.401846 -0.368761 0.356498 -0.285112 -0.443525 -0.263600 0.183037 -0.336284 -0.149677 -0.322614 -0.207102 0.203594 0.202894 0.207803 0.237672 0.199513 0.237713 0.207647 0.200347 0.209440 0.208894 0.213101 0.232561 0.229021 0.245818 0.245477 0.211298 0.229092 0.210074 0.216903 0.229350 0.249216 0.251578 0.238596 0.238269 0.230487
chargesum: 0.00000
title: Mulliken charges with hydrogens summed into heavy atoms:
elementType: O O N C C C C C C C C C C C C C C C C C C C
charge: -0.280871 -0.281613 -0.050990 0.318756 -0.189247 -0.077874 -0.077391 -0.085450 0.496844 -0.146544 -0.182791 -0.156028 -0.123284 0.356498 0.155278 -0.016548 0.214966 0.183037 -0.084705 0.088919 -0.084345 0.023385
polarizability: 2.56121504e+02 -1.86985172e+00 2.01982381e+02 7.17207295e+00 -4.34744528e-01 2.00297738e+02
1716.lowfreq: -16.5142 -6.4681 -0.0006 -0.0003 0.0001 2.9361 6.6461 10.9243 23.9498
frequency: -10.7534 10.6170 23.7630 34.5637 47.6973 66.7679 78.0797 98.4986 113.6277 147.8794 180.7340 196.9065 201.6863 211.3324 221.6839 247.0304 259.2873 277.2787 280.1050 326.2006 342.7485 352.8319 376.2479 398.5277 410.2339 413.6180 414.7676 422.6938 453.7325 470.5243 515.3615 523.8097 587.3307 605.9361 623.9967 633.8083 697.8278 734.5234 736.8874 748.6017 778.3267 782.4036 811.5997 822.9820 843.0619 847.0872 874.5439 884.6310 890.9060 899.7040 927.9060 928.3896 934.2055 940.6576 941.3455 949.9006 951.9875 956.4847 963.7789 987.3498 1004.8256 1020.8256 1024.7680 1032.2590 1041.5219 1083.1677 1090.9709 1107.4562 1124.4924 1148.1218 1156.0466 1179.3751 1197.8174 1202.3833 1207.1216 1217.2121 1223.0151 1237.5575 1255.0090 1280.5690 1281.3139 1290.8290 1310.0661 1311.8420 1331.9916 1345.9565 1370.4405 1371.1136 1372.8989 1373.3534 1386.4913 1397.5725 1414.1925 1416.4977 1437.6610 1446.8924 1457.4120 1459.2375 1465.7826 1468.0951 1476.0399 1476.5607 1481.8353 1483.1021 1495.6542 1501.7910 1558.3940 1581.5570 1587.1387 1622.2874 2961.2377 2962.9114 2964.3667 2964.5479 2971.5075 3004.7650 3020.6479 3020.8319 3032.4895 3054.0001 3058.3521 3059.7550 3065.4167 3066.5446 3072.3414 3077.1963 3091.3134 3121.0635 3125.9393 3132.8702 3144.9100 3159.3020 3163.2047 3171.4578 3182.3446
redmass: 3.0829 5.1545 4.2990 4.8171 3.3844 3.8844 4.7004 6.2339 4.1761 2.7342 3.7306 1.1808 2.6042 2.9906 4.3614 1.5431 1.7263 1.1721 1.9154 3.5005 2.1698 2.7584 2.4306 2.0035 3.3166 2.9618 3.5148 3.0125 3.0512 2.9651 2.8745 2.6815 3.8801 7.2213 5.4369 6.5560 3.5656 2.9576 2.4818 3.2958 1.7376 3.1888 2.0536 1.7775 1.9499 2.3773 1.3259 1.8235 3.1738 2.2217 1.5947 1.6099 2.5517 1.4012 1.2340 1.4229 4.7073 4.3317 1.3470 1.3194 2.7036 1.4343 1.4303 2.1647 2.1202 1.8568 1.6514 1.3835 2.3016 1.2364 1.0790 1.2765 1.1153 1.1264 2.1177 2.1813 4.2167 3.0252 3.0684 1.5265 1.5503 1.4871 1.3440 1.5667 9.8395 1.3489 1.3103 1.6036 1.2951 1.5247 2.4539 1.2132 2.0308 3.2431 1.0914 2.0708 1.0503 1.0772 1.0659 1.0474 1.1226 1.1704 1.0625 1.0614 1.0623 2.2422 6.4341 6.9385 5.7869 6.4607 1.0385 1.0510 1.0480 1.0443 1.0399 1.0623 1.1020 1.0597 1.1040 1.1000 1.0993 1.0992 1.0984 1.1010 1.0994 1.0986 1.1069 1.0891 1.0887 1.0886 1.0899 1.0939 1.0953 1.0952 1.1002
irintensity: 0.0489 0.0388 0.0454 0.6415 0.0261 0.7796 0.9430 2.6764 0.5519 3.0098 3.4762 0.9554 6.9839 6.1675 4.6734 0.9212 0.1187 0.3851 0.4038 3.8814 0.1452 1.4562 0.7716 0.0579 0.5169 0.0156 3.6334 0.7402 0.2809 3.5242 6.5514 12.8603 18.9575 2.0153 1.6372 0.7991 2.2301 14.7656 14.9631 2.9414 75.7143 19.8212 16.6193 0.6323 49.2651 2.2053 0.5793 1.0202 6.6312 6.1552 0.4446 1.1631 91.9726 6.5027 0.9852 2.4779 21.8682 48.7359 0.8658 0.3748 7.0658 0.2895 0.4081 5.4389 54.0845 4.1415 3.9095 7.6766 10.1801 11.8455 11.6721 98.1859 4.1136 24.9405 10.8535 57.1664 229.0956 21.1790 221.5237 7.1348 6.5681 2.4878 0.6885 1.7661 46.6319 8.5342 18.6669 3.4236 17.2362 15.1807 18.2800 13.8470 44.2966 2.3926 17.2411 170.9336 0.1149 0.4899 3.1081 2.5325 2.0301 82.4396 7.0570 12.2204 25.3553 102.4512 26.9943 9.7111 138.9557 50.4566 16.5787 65.0057 3.8459 77.9107 23.5156 16.9786 15.5183 21.9195 45.7869 0.2191 8.6635 52.3043 91.3080 28.6229 14.6933 82.4426 31.6649 17.2659 21.1274 14.2906 12.4698 17.9022 4.0816 23.6724 8.4044
temp: 298.150 k
press: 1.00000 atm
elementType: 8 8 7 6 6 6 6 6 6 6 6 6 6 6 6 6 6 6 6 6 6 6 1 1 1 1 1 1 1 1 1 1 1 1 1 1 1 1 1 1 1 1 1 1 1 1 1
symmnumber: 1
zpe: 1039930.7 jmol-1
zpe.correction: 0.396089 hartree
zpe.thermalcorrener: 0.417421 hartree
zpe.thermalcorrenthalpy: 0.418366 hartree
zpe.thermalcorrgfe: 0.343577 hartree
zpe.sumelectzpe: -942.555234 hartree
zpe.sumelectthermal: -942.533902 hartree
zpe.sumelectthermalent: -942.532957 hartree
zpe.sumelectthermalfe: -942.607746 hartree
dipole: 0.6790 0.7502 -1.5193
dipole: 1.8254
quadrupole: -123.5594 -125.1370 -125.7682
quadrupole: 4.1455 -2.3475 1.5307
quadrupole: 1.2621 -0.3154 -0.9467 4.1455 -2.3475 1.5307
hfenergy: -942.951323 hartree
pointgroup: C01 [X(C19H25N1O2)]
dipole: 0.2358574 0.2451778 -0.6324745 debye
polarizability: 256.7127688|-1.4673809|201.9092324|4.4175141|-0.5111061|199.7796218 unknown
InChI: InChI=1S/C19H25NO2/c1-19(2,3)15-16-8-10-17(11-9-16)21-13-6-14-22-18-7-4-5-12-20-18/h4-5,7-12H,6,13-15H2,1-3H3
charge 0 multiplicity 1
47 atoms
O  0.513046 -1.981294 0.512469
O  3.713925 -0.679992 -0.849273
N  4.902101 0.719892 0.647907
C  -5.173359 1.408829 0.031321
C  -4.961394 -0.142943 0.193634
C  -4.556951 1.90712 -1.300927
C  -4.531689 2.177302 1.214893
C  -6.703246 1.671486 0.01802
C  -3.520915 -0.630596 0.246449
C  -2.820674 -0.73067 1.481054
C  -2.82649 -1.012704 -0.927923
C  -1.487298 -1.176674 1.540689
C  -1.486395 -1.462947 -0.893279
C  -0.812188 -1.542067 0.349868
C  1.260031 -2.374448 -0.697651
C  2.666591 -2.766381 -0.238537
C  3.476048 -1.589543 0.307291
C  4.435058 0.479828 -0.602957
C  4.642975 1.352628 -1.706224
C  5.374533 2.53101 -1.47784
C  5.61047 1.872742 0.846189
C  5.872981 2.80569 -0.176278
H  -5.488048 -0.452288 1.119221
H  -5.48677 -0.635622 -0.649472
H  -4.731664 2.992738 -1.425283
H  -3.466828 1.730783 -1.328144
H  -5.01056 1.38962 -2.168387
H  -3.437288 2.030057 1.242159
H  -4.728133 3.262344 1.123103
H  -4.947502 1.838512 2.18346
H  -7.173721 1.33557 0.961962
H  -7.19314 1.133668 -0.816308
H  -6.916216 2.750412 -0.102228
H  -3.33374 -0.459577 2.411689
H  -3.343163 -0.964819 -1.894438
H  -0.953654 -1.25513 2.493047
H  -0.990344 -1.75014 -1.825034
H  0.751318 -3.231574 -1.184447
H  1.303727 -1.524408 -1.406686
H  3.207256 -3.21836 -1.091649
H  2.584827 -3.535377 0.552688
H  4.450928 -1.910256 0.71551
H  2.929016 -1.040274 1.092489
H  4.237177 1.094616 -2.687645
H  5.555868 3.230221 -2.301057
H  5.972291 2.03726 1.867536
H  6.445007 3.713354 0.035715
