program: Gaussian 09
title: 000189555
version: EM64L-G09RevD.01
frameworkgroup: C1[X(C7H16NO5P)]
method: RPBEPBE
basis: SDD
operation: Freq
keyword: #p
keyword: freq=noraman
keyword: PBEPBE/SDD
title: #p freq=noraman PBEPBE/SDD
converged: YES YES NO NO
title: Mulliken charges:
elementType: P O O O O O N C C C C C C C H H H H H H H H H H H H H H H H
charge: 1.211093 -0.674893 -0.676810 -0.629792 -0.407337 -0.243045 -0.651000 -0.515213 -0.387343 -0.367302 -0.344534 -0.189330 -0.706804 0.153987 0.307311 0.255300 0.254250 0.251639 0.220044 0.235182 0.219718 0.258879 0.242360 0.219005 0.213954 0.316108 0.279677 0.386614 0.385515 0.382767
chargesum: 0.00000
title: Mulliken charges with hydrogens summed into heavy atoms:
elementType: P O O O O O N C C C C C C C
charge: 1.211093 -0.288279 -0.291295 -0.629792 -0.024570 -0.243045 -0.055215 -0.207902 0.122207 0.104381 0.110367 0.069549 -0.031485 0.153987
polarizability: 1.29001480e+02 2.18416476e+00 1.28135274e+02 -6.79220494e+00 -1.53479058e+00 1.03760248e+02
1716.lowfreq: -4.6117 0.0002 0.0011 0.0015 4.3740 9.1793 21.5909 23.9234 39.2669
frequency: 20.8076 23.7440 39.2653 55.4083 72.2056 87.8857 109.8147 130.6948 156.4588 177.2657 184.3428 208.8645 236.5620 258.7137 272.6151 279.6979 307.0945 320.9101 332.0997 354.1695 379.9260 407.3630 434.4767 485.7179 525.1532 573.5585 589.3389 635.4910 637.3909 693.3017 717.6838 722.8127 769.6853 788.5104 801.8571 868.9420 926.9243 970.3454 973.5995 985.0969 1002.8606 1038.5498 1050.1130 1057.0815 1081.5184 1094.4998 1133.7590 1148.6189 1182.9092 1204.3273 1217.6163 1244.4919 1255.0713 1273.9618 1300.9266 1313.3058 1329.2554 1347.3123 1370.3809 1385.8129 1394.8340 1455.9127 1465.8583 1478.2027 1486.6924 1497.5401 1607.0267 1661.6716 2920.6470 2978.2307 2992.8608 2996.2797 3009.9021 3015.3614 3046.6972 3047.9780 3074.6840 3075.8117 3082.9318 3486.1403 3518.4622 3589.7189 3593.1210 3630.2004
redmass: 5.0308 7.1502 5.9676 6.2366 3.1714 4.4249 2.4033 2.9868 2.1815 2.6627 3.9400 1.2478 1.4792 2.8731 3.5444 2.8144 2.6622 2.4586 3.0288 1.2939 4.8488 3.6711 3.8458 3.1513 2.5818 2.1047 1.6319 1.7367 3.4584 4.7071 5.6553 5.4367 1.3851 3.2058 1.3894 2.2095 2.3954 1.8510 2.1250 1.2993 1.6139 2.5770 2.1663 2.2818 1.7149 2.0772 1.5195 2.2733 1.8373 1.3609 1.4012 1.3088 1.3679 1.6548 1.1741 1.2323 1.2905 1.3729 1.5265 1.7182 1.1998 1.0957 1.0700 1.0415 1.0768 1.0612 1.4084 3.2013 1.0814 1.0360 1.0620 1.0607 1.0610 1.0817 1.1006 1.1002 1.1015 1.1010 1.1008 1.0466 1.0641 1.0659 1.0662 1.0984
irintensity: 0.2439 0.6931 1.1403 0.1105 0.2367 0.8258 11.7389 4.5630 3.9451 0.4334 4.1236 23.2836 8.3734 41.3892 8.3303 28.7383 3.1777 18.5034 109.8429 150.1323 10.4226 24.7876 17.6861 15.1290 99.1472 33.4212 33.6908 260.7381 17.2879 157.6634 152.7378 127.5492 26.5450 1.9189 3.9064 2.9376 5.9676 18.5361 6.4256 17.6370 7.9363 21.5415 31.3929 265.7474 14.3947 78.3979 0.5484 7.0556 12.0912 3.3789 3.9978 2.0642 2.6198 17.3557 2.8918 0.7041 5.4286 2.3176 1.4063 7.0003 11.6741 1.2335 13.8197 5.9751 22.6515 5.0431 190.5234 119.2382 42.1649 28.7807 10.7687 2.0849 24.2957 10.0282 1.3705 11.9215 19.8972 52.0182 22.9589 15.1795 28.8768 48.8273 39.8153 17.8277
temp: 298.150 k
press: 1.00000 atm
elementType: 15 8 8 8 8 8 7 6 6 6 6 6 6 6 1 1 1 1 1 1 1 1 1 1 1 1 1 1 1 1
symmnumber: 1
zpe: 625975.5 jmol-1
zpe.correction: 0.238421 hartree
zpe.thermalcorrener: 0.256639 hartree
zpe.thermalcorrenthalpy: 0.257583 hartree
zpe.thermalcorrgfe: 0.190337 hartree
zpe.sumelectzpe: -1047.301685 hartree
zpe.sumelectthermal: -1047.283468 hartree
zpe.sumelectthermalent: -1047.282524 hartree
zpe.sumelectthermalfe: -1047.349770 hartree
dipole: 0.5760 0.0856 0.5264
dipole: 0.7850
quadrupole: -88.4802 -78.9861 -101.1843
quadrupole: 1.1600 6.8546 5.8203
quadrupole: 1.0700 10.5641 -11.6341 1.1600 6.8546 5.8203
hfenergy: -1047.5401067 hartree
pointgroup: C01 [X(C7H16N1O5P1)]
dipole: 0.223869 0.0614531 0.2036869 debye
polarizability: 128.2817012|2.1602777|128.6440918|-6.9141959|-2.4783487|103.9712091 unknown
InChI: InChI=1S/C7H16NO5P/c1-2-5(14(11,12)13)3-4-6(8)7(9)10/h5-6,9,11-12H,2-4,8H2,1H3
charge 0 multiplicity 1
30 atoms
P  -2.306733 -1.048176 0.141576
O  -1.690671 -2.264214 -0.941167
O  -3.957207 -0.795531 -0.351603
O  -2.175445 -1.46249 1.680311
O  2.712101 -1.759551 0.178881
O  3.689404 -0.106472 -1.12303
N  2.506247 1.910956 0.331668
C  -1.502783 0.499591 -0.548203
C  0.039211 0.355991 -0.55261
C  0.699554 0.235014 0.83639
C  -2.06239 1.743363 0.194107
C  2.231138 0.539122 0.775049
C  -1.497627 3.063711 -0.375242
C  2.953681 -0.4278 -0.162113
H  -1.85409 0.520742 -1.598542
H  0.311371 -0.516483 -1.176397
H  0.453609 1.25505 -1.046341
H  0.540196 -0.76697 1.273723
H  0.264803 0.970581 1.538365
H  -3.164574 1.741807 0.100749
H  -1.837632 1.674585 1.275783
H  2.639059 0.326747 1.790139
H  -0.406944 3.144323 -0.21946
H  -1.977097 3.927922 0.11911
H  -1.693937 3.145588 -1.460878
H  3.221343 1.986713 -0.397268
H  2.576999 2.606552 1.074204
H  -1.673821 -3.172465 -0.544987
H  -4.616966 -1.296566 0.192234
H  3.202002 -2.354938 -0.450648
