program: Gaussian 09
title: 000189541
version: EM64L-G09RevD.01
frameworkgroup: C1[X(C19H14O4)]
method: RPBEPBE
basis: SDD
operation: Freq
keyword: #pfreq=noraman
keyword: PBEPBE/SDD
title: #p freq=noraman PBEPBE/SDD
converged: NO YES NO NO
title: Mulliken charges:
elementType: O O O O C C C C C C C C C C C C C C C C C C C H H H H H H H H H H H H H H
charge: -0.290616 -0.479743 -0.461933 -0.306272 -0.247244 -0.219462 0.059747 0.265003 0.174113 0.064725 0.181389 -0.384938 -0.377640 0.265777 -0.411329 -0.220635 -0.238044 0.327666 -0.373264 -0.358044 -0.237323 -0.223135 -0.233447 0.252315 0.234540 0.291415 0.258258 0.257229 0.384782 0.376489 0.234115 0.233780 0.234471 0.260533 0.235358 0.234068 0.237298
chargesum: 0.00000
title: Mulliken charges with hydrogens summed into heavy atoms:
elementType: O O O O C C C C C C C C C C C C C C C C C C C
charge: -0.290616 -0.094961 -0.085444 -0.306272 0.005070 0.015079 0.059747 0.265003 0.174113 0.064725 0.181389 -0.093523 -0.119382 0.265777 -0.154100 0.013480 -0.004264 0.327666 -0.138793 -0.097511 -0.001965 0.010932 0.003851
polarizability: 3.34241206e+02 6.72884806e-01 2.77519495e+02 -2.42746475e+00 4.91253208e+00 9.56356976e+01
1716.lowfreq: -5.4097 0.0005 0.0006 0.0008 2.9388 4.8968 29.0465 38.9930 70.3546
frequency: 28.9648 38.9506 70.3544 74.6141 79.4243 123.2220 139.6495 189.4448 193.5780 228.2076 235.9484 245.4426 279.8892 304.4091 320.0416 377.9125 379.6243 399.8784 406.0657 433.3873 442.9376 470.4634 480.3052 486.4201 512.4970 526.7968 610.6877 615.7455 624.2447 631.6587 637.8407 645.7032 664.1073 693.9488 698.9423 718.0543 735.4288 779.8710 782.8491 800.3550 819.8257 848.4003 852.4212 870.3259 898.7539 924.7238 937.2669 963.8506 972.4923 985.2847 989.5491 998.5664 1005.0885 1005.5404 1022.1325 1031.7389 1033.5376 1062.1281 1087.7774 1095.6993 1129.4779 1151.0138 1173.4361 1177.4283 1182.7268 1194.9797 1199.1777 1233.5302 1243.6695 1254.7149 1275.0966 1291.1943 1310.1650 1320.4836 1330.5817 1374.3426 1377.8976 1386.2087 1394.9347 1407.9268 1439.1390 1442.7664 1479.7200 1482.5475 1523.2612 1556.8856 1582.4806 1587.2418 1613.4070 1614.2813 1631.3287 2905.3793 2924.3691 3133.6848 3135.0680 3141.9588 3151.9039 3154.0505 3166.7253 3168.5834 3177.7630 3178.8228 3186.1248 3213.4481 3537.3502
redmass: 3.7328 6.2047 7.3104 6.0180 6.0852 5.4889 4.6987 5.4794 5.3845 6.2132 6.0283 5.3019 5.9406 5.5222 8.8680 5.3176 4.8502 2.8047 5.9176 4.0906 5.2331 3.8687 1.4489 3.7771 3.5919 8.5350 6.4507 6.4516 4.3571 5.1872 4.8874 5.6169 6.0286 1.7281 1.2979 2.7108 3.2387 1.6325 1.7444 4.5734 4.4844 2.4066 1.7883 1.5892 1.4345 5.9148 1.4870 2.8454 1.9705 1.5195 4.4560 2.0901 1.3867 2.0969 5.0994 2.5492 2.1361 3.5204 1.6751 3.6883 2.0042 3.0287 1.1267 1.0572 1.5364 1.1865 1.2863 1.2717 1.7957 2.5425 1.4740 1.2915 2.3274 1.1990 1.6957 2.1265 6.3574 7.1172 2.2431 2.8466 2.3629 2.4700 2.3605 2.9287 6.1600 8.1265 6.1573 6.7224 6.1211 6.5118 8.2354 1.0782 1.0833 1.0853 1.0862 1.0885 1.0913 1.0938 1.0972 1.0960 1.0987 1.0973 1.0920 1.0669 1.0651
irintensity: 0.0607 0.0152 2.8031 0.3115 0.1493 2.3912 0.1835 3.5024 0.5119 4.5166 1.5668 14.2561 3.4564 7.8553 9.0288 13.5582 2.5244 0.0702 2.8589 2.6035 3.3158 6.7554 125.9874 35.3715 24.4656 2.4042 3.2825 0.5107 22.8679 13.3901 14.7105 42.4685 3.4407 34.4289 164.3588 33.6831 7.0213 14.6575 112.5425 4.3013 17.2330 7.3159 10.6595 25.8046 5.0620 25.9868 3.3166 16.7168 11.8189 1.1325 2.9810 33.0651 4.9053 33.6748 12.8149 18.6833 0.3681 23.3119 7.2827 65.1313 27.4152 37.4999 9.3159 0.2664 84.6898 4.6045 64.5956 9.8032 10.0868 35.9374 31.2590 0.1911 52.4045 49.9835 7.1309 152.3613 124.7504 20.1057 74.4003 194.1463 21.3983 56.4174 20.1818 27.0540 83.3156 140.8896 47.0117 10.1076 1.4031 19.3377 236.3322 3.9997 57.4085 1.0962 2.4805 3.2396 17.0561 20.1221 24.1867 11.3815 10.0923 12.0800 5.3281 222.5340 31.6031
temp: 298.150 k
press: 1.00000 atm
elementType: 8 8 8 8 6 6 6 6 6 6 6 6 6 6 6 6 6 6 6 6 6 6 6 1 1 1 1 1 1 1 1 1 1 1 1 1 1
symmnumber: 1
zpe: 736003.9 jmol-1
zpe.correction: 0.280329 hartree
zpe.thermalcorrener: 0.298347 hartree
zpe.thermalcorrenthalpy: 0.299291 hartree
zpe.thermalcorrgfe: 0.233819 hartree
zpe.sumelectzpe: -1031.723835 hartree
zpe.sumelectthermal: -1031.705817 hartree
zpe.sumelectthermalent: -1031.704873 hartree
zpe.sumelectthermalfe: -1031.770345 hartree
dipole: 4.8615 4.5551 -0.1377
dipole: 6.6635
quadrupole: -116.4607 -133.0969 -136.9489
quadrupole: -6.1150 -0.2798 1.0071
quadrupole: 12.3748 -4.2614 -8.1133 -6.1150 -0.2798 1.0071
hfenergy: -1032.0041638 hartree
pointgroup: C01 [X(C19H14O4)]
dipole: 1.8020714 -1.9040064 0.0117433 debye
polarizability: 333.938619|-3.9607832|277.8228964|-3.3420466|4.5326067|95.634883 unknown
InChI: InChI=1S/C19H14O4/c20-14-10-15(11-6-2-1-3-7-11)23-19-13-9-5-4-8-12(13)17(21)18(22)16(14)19/h1-10,17-18,21-22H
charge 0 multiplicity 1
37 atoms
O  0.701246 -0.367543 0.008306
O  -2.738566 3.099843 -0.245518
O  -4.726548 1.077192 -0.143835
O  -0.170776 3.688696 0.289321
C  -2.417581 1.794587 0.329073
C  -3.321352 0.792792 -0.409882
C  -0.951631 1.406306 0.165657
C  -2.998546 -0.644441 -0.038852
C  -1.628509 -1.010908 0.136941
C  -0.629498 0.064998 0.086404
C  0.098642 2.427875 0.183734
C  -3.999955 -1.628336 0.062118
C  -1.281185 -2.363478 0.382446
C  1.74649 0.574454 0.002771
C  1.46396 1.922615 0.07775
C  -3.649528 -2.975312 0.31893
C  -2.291294 -3.343836 0.468811
C  3.076049 -0.060284 -0.10003
C  4.257203 0.687386 0.164264
C  3.19598 -1.429111 -0.468086
C  5.524375 0.082069 0.055026
C  4.46654 -2.030692 -0.574933
C  5.636016 -1.279259 -0.315645
H  -2.67216 1.788827 1.414422
H  -3.107356 0.940293 -1.4955
H  -5.04287 -1.323048 -0.0581
H  -0.230114 -2.632914 0.521998
H  2.270045 2.658731 0.051431
H  -1.954545 3.704025 -0.043222
H  -4.8452 2.051781 -0.29476
H  -4.434247 -3.735393 0.40095
H  -2.023587 -4.387824 0.663041
H  4.19008 1.73579 0.472502
H  2.292472 -2.008036 -0.678382
H  6.424915 0.66864 0.265488
H  4.544847 -3.084139 -0.864261
H  6.622588 -1.747748 -0.398777
