program: Gaussian 09
title: 000189539
version: EM64L-G09RevD.01
frameworkgroup: C1[X(C21H22N2O4)]
method: RPBEPBE
basis: SDD
operation: Freq
keyword: #p
keyword: freq=noraman
keyword: PBEPBE/SDD
title: #p freq=noraman PBEPBE/SDD
converged: YES YES NO NO
title: Mulliken charges:
elementType: O O O O N N C C C C C C C C C C C C C C C C C C C C C H H H H H H H H H H H H H H H H H H H H H H
charge: -0.266031 -0.247255 -0.228550 -0.228321 -0.126730 0.022272 -0.466440 0.417891 -0.300687 -0.360692 -0.368318 -0.650837 0.540877 -0.441010 -0.411518 -0.322152 -0.351379 0.548748 -0.378482 -0.398087 0.166701 0.365584 -0.377717 -0.379845 0.343714 -0.751040 -0.625247 0.271577 0.232883 0.238675 0.254120 0.223909 0.240500 0.237316 0.231983 0.235907 0.226659 0.222988 0.218321 0.221631 0.229125 0.234968 0.281885 0.282965 0.246150 0.234960 0.218538 0.232951 0.256537
chargesum: 0.00000
title: Mulliken charges with hydrogens summed into heavy atoms:
elementType: O O O O N N C C C C C C C C C C C C C C C C C C C C C
charge: -0.266031 -0.247255 -0.228550 -0.228321 -0.126730 0.022272 0.038020 0.417891 0.192108 -0.136783 -0.127817 0.054370 0.540877 -0.214351 -0.188530 -0.103830 -0.129747 0.548748 -0.149357 -0.163118 0.166701 0.365584 -0.095832 -0.096880 0.343714 -0.051392 -0.135758
polarizability: 8.43073872e+02 -2.55788405e+01 2.24844951e+02 7.04711995e+01 2.78911338e+01 1.53383281e+02
1716.lowfreq: -6.0042 -1.5066 -0.0015 -0.0006 0.0004 3.0008 11.2400 16.1180 18.5899
frequency: 11.1673 15.5791 18.4903 30.8239 39.9530 45.8905 56.8726 70.2121 73.7734 75.2145 81.6020 126.3746 135.9845 153.3874 170.0424 177.9156 193.6452 206.1994 222.5044 243.7205 265.5252 303.5884 305.4781 345.1735 360.6590 367.6926 377.0026 393.6115 414.4954 419.1234 430.7001 455.6044 462.4665 483.2675 489.4036 516.2975 519.9319 534.2542 540.0558 583.6758 626.8738 632.9474 636.7073 641.8243 662.8221 704.1108 727.6102 747.4541 760.8900 771.9538 783.6065 802.8725 818.6932 823.2555 835.0869 837.0026 847.3395 867.2071 896.8355 902.0765 941.3094 943.2808 957.9705 966.1233 973.5805 991.8183 993.0572 993.2334 993.8140 998.1736 1009.0655 1015.1712 1052.8683 1066.6180 1095.8005 1104.6174 1110.5423 1111.8894 1130.5181 1140.4263 1178.2383 1198.4995 1216.3309 1222.1773 1224.9516 1247.3488 1254.6795 1276.2673 1291.3594 1295.3284 1306.8050 1321.0468 1337.3799 1349.7638 1351.7260 1364.8730 1377.8050 1383.1277 1396.9772 1403.2422 1415.6567 1433.9988 1438.9782 1442.7372 1454.7467 1456.9415 1470.9845 1475.9554 1479.6777 1483.1711 1499.9800 1528.8521 1548.5439 1574.7978 1594.5769 1606.2646 1627.1925 1639.6456 1651.5531 2955.4156 2990.3800 3000.1286 3025.2292 3026.9431 3072.8420 3076.3338 3089.1483 3100.3247 3103.3692 3105.2585 3106.8183 3115.4207 3118.3895 3133.1338 3135.4794 3148.7053 3161.8215 3171.7720 3180.4835 3182.9216 3217.3772
redmass: 5.7929 5.3775 4.6281 5.2103 4.6767 4.6699 4.7231 5.6771 5.0872 5.3473 5.1876 4.0079 5.7202 4.5263 2.6408 1.1413 4.9188 2.5782 1.4968 3.9574 3.2527 4.0626 3.5854 3.7489 3.3011 4.0588 3.5192 3.8979 2.9478 2.9259 4.1162 3.3956 4.0319 3.5117 3.0204 4.9376 3.8382 2.8623 2.5081 3.4135 7.1368 1.5466 6.7934 6.8923 4.6162 4.5461 3.5021 3.9282 5.8821 8.4009 2.1033 1.3036 1.6358 5.3584 3.3748 1.2894 1.6425 4.2038 2.0457 2.4163 1.8601 1.3475 1.3860 2.7246 1.2467 1.3188 1.3458 1.3149 2.9257 3.0114 1.4174 3.5926 1.5084 1.7641 3.2363 4.1262 1.3501 1.3587 2.1857 1.5551 1.6441 1.5582 1.8016 2.0099 2.4097 1.3066 1.2766 1.4246 3.2283 1.4486 2.0159 1.7325 1.4343 6.1877 1.3995 1.3061 3.1193 2.6466 1.1673 4.0634 1.2498 4.3378 1.1551 1.4713 1.6033 1.2138 1.0618 1.0512 1.3220 1.8689 1.1318 2.8651 5.9445 7.0598 5.4201 9.9587 5.7919 5.7981 5.1205 1.0380 1.0364 1.0653 1.0627 1.0983 1.0969 1.0981 1.0903 1.1005 1.0867 1.0621 1.0965 1.1041 1.0895 1.0901 1.0880 1.0886 1.0929 1.0938 1.0944 1.0955 1.1157
irintensity: 0.5038 0.2425 1.0533 0.3071 0.3645 0.9262 0.7772 3.7065 0.7001 0.6621 0.2046 1.4968 1.5166 4.4812 1.1458 1.7739 1.5039 6.7182 1.8382 1.3420 5.4002 0.1555 2.4360 12.5321 3.0413 14.5092 3.8865 2.8646 0.0378 0.4586 4.4986 0.0251 7.6057 4.3392 2.1038 3.6852 12.7502 19.4888 10.6298 3.9447 0.7078 15.7878 0.3504 0.4132 27.5004 12.0034 1.3461 0.3386 26.6622 3.2550 11.6178 4.0232 38.5448 9.8325 2.9700 2.1791 67.3220 0.3455 13.6955 13.7366 1.4231 12.8680 3.6829 133.0928 50.3647 3.2238 0.0766 57.4048 0.1135 2.0153 28.3553 4.8944 6.5041 22.0572 65.8973 813.0404 21.2858 9.3222 4.2950 4.0959 855.7574 482.9196 62.6608 149.4931 679.2716 0.9094 32.8588 65.0902 107.3495 0.1225 14.6272 19.2483 25.5560 101.8878 193.5439 6.6542 236.3857 78.2586 18.4019 29.7602 14.4203 48.2834 17.1749 24.8268 4.7797 9.7505 59.5017 19.5588 46.9891 3.0954 72.0415 318.4586 18.7071 56.6257 1548.9601 125.4675 233.1345 43.9177 4.0509 130.8289 13.7671 48.2021 28.3580 37.8198 18.1747 6.5013 1.9521 32.5271 28.5622 4.0557 19.0657 31.0952 9.8235 10.4490 7.3885 6.2185 37.3590 24.2469 0.7501 1.3420 4.8877
temp: 298.150 k
press: 1.00000 atm
elementType: 8 8 8 8 7 7 6 6 6 6 6 6 6 6 6 6 6 6 6 6 6 6 6 6 6 6 6 1 1 1 1 1 1 1 1 1 1 1 1 1 1 1 1 1 1 1 1 1 1
symmnumber: 1
zpe: 1014877.6 jmol-1
zpe.correction: 0.386546 hartree
zpe.thermalcorrener: 0.412675 hartree
zpe.thermalcorrenthalpy: 0.413619 hartree
zpe.thermalcorrgfe: 0.325275 hartree
zpe.sumelectzpe: -1221.775693 hartree
zpe.sumelectthermal: -1221.749564 hartree
zpe.sumelectthermalent: -1221.748620 hartree
zpe.sumelectthermalfe: -1221.836964 hartree
dipole: 12.1271 1.2942 1.2473
dipole: 12.2596
quadrupole: -253.3422 -145.8085 -159.0712
quadrupole: 14.2472 -10.3710 6.3701
quadrupole: -67.2683 40.2655 27.0028 14.2472 -10.3710 6.3701
hfenergy: -1222.1622391 hartree
pointgroup: C01 [X(C21H22N2O4)]
dipole: -4.7686895 -0.5288894 -0.4939121 debye
polarizability: 843.7942867|65.9536937|159.2879104|-27.6675559|34.9275724|218.2199075 unknown
InChI: InChI=1S/C21H22N2O4/c1-16(2)21(24)27-15-14-22(3)19-10-6-17(7-11-19)4-5-18-8-12-20(13-9-18)23(25)26/h4-13H,1,14-15H2,2-3H3
charge 0 multiplicity 1
49 atoms
O  -5.694952 0.91354 -0.032795
O  -7.625253 0.200593 1.067211
O  9.119557 1.205123 0.79398
O  9.383379 0.003266 -1.132422
N  -3.638394 -1.280696 0.448274
N  8.649251 0.491015 -0.181218
C  -4.544069 -0.729558 1.467336
C  -2.268941 -1.004951 0.466935
C  -4.942284 0.744226 1.239025
C  -1.654124 -0.254187 1.523004
C  -1.410023 -1.479014 -0.581984
C  -4.230702 -1.997616 -0.692912
C  0.586944 -0.493524 0.491444
C  -0.272825 -0.017118 1.525877
C  -0.032756 -1.231362 -0.562598
C  2.01599 -0.20624 0.557317
C  2.986643 -0.599486 -0.338214
C  4.414981 -0.299231 -0.257356
C  5.004513 0.480249 0.789886
C  5.283644 -0.804688 -1.276115
C  -7.066564 0.611259 0.018338
C  7.20525 0.219621 -0.209304
C  6.38083 0.739764 0.81934
C  6.663753 -0.554806 -1.26208
C  -7.72068 0.851845 -1.30957
C  -6.877077 1.351883 -2.46382
C  -9.057896 0.605128 -1.394471
H  -5.460454 -1.341969 1.501581
H  -4.081242 -0.80688 2.469809
H  -5.569557 1.094682 2.07905
H  -4.060568 1.39105 1.111847
H  -2.250967 0.144592 2.348039
H  -1.828925 -2.04465 -1.418475
H  -4.123607 -1.430819 -1.639525
H  -5.305591 -2.146217 -0.507976
H  -3.766904 -2.994076 -0.826194
H  0.162091 0.558148 2.353256
H  0.574873 -1.617309 -1.388681
H  2.323219 0.389273 1.429456
H  2.687947 -1.200552 -1.20807
H  4.376456 0.888243 1.58806
H  4.854569 -1.403593 -2.088083
H  6.838204 1.334016 1.614884
H  7.329649 -0.939923 -2.038681
H  -6.402261 2.318448 -2.218509
H  -6.054117 0.650019 -2.690176
H  -7.492538 1.479238 -3.37014
H  -9.607704 0.760641 -2.32881
H  -9.615368 0.247702 -0.521775
