program: Gaussian 09
title: 000189531
version: EM64L-G09RevD.01
frameworkgroup: C1[X(C14H18O3)]
method: RPBEPBE
basis: SDD
operation: Freq
keyword: #pfreq=noraman
keyword: PBEPBE/SDD
title: #p freq=noraman PBEPBE/SDD
converged: YES YES NO NO
title: Mulliken charges:
elementType: O O O C C C C C C C C C C C C C C H H H H H H H H H H H H H H H H H H
charge: -0.288223 -0.303569 -0.298850 0.235076 0.263271 0.153061 -0.234967 0.238709 -0.317769 -0.717446 -0.697909 -0.601119 -0.034069 0.267203 -0.844352 -0.528111 -0.528360 0.228140 0.244522 0.233900 0.200956 0.239001 0.239234 0.213514 0.230164 0.275378 0.233414 0.273242 0.223404 0.219687 0.251906 0.226116 0.220216 0.258318 0.226316
chargesum: 0.00000
title: Mulliken charges with hydrogens summed into heavy atoms:
elementType: O O O C C C C C C C C C C C C C C
charge: -0.288223 -0.303569 -0.298850 0.235076 0.263271 0.153061 -0.006827 0.238709 -0.073247 -0.043590 -0.014998 -0.325741 -0.034069 0.267203 -0.114292 0.169597 0.176490
polarizability: 2.49018360e+02 -6.56748587e+00 1.62559435e+02 9.49378457e-01 2.21336629e+00 1.02542682e+02
1716.lowfreq: -12.9854 -7.3775 -4.5831 0.0002 0.0004 0.0006 41.6911 58.4271 82.2635
frequency: 41.4279 58.4130 82.2622 94.6007 105.6999 149.4747 162.3502 164.5283 168.8293 198.0133 204.4383 209.7001 226.6023 241.6972 262.4264 274.3275 294.7699 327.1176 346.9891 360.0117 394.5773 418.2558 430.4606 465.6335 508.3458 544.9827 552.0051 574.7277 594.6310 647.6608 679.8530 715.5148 742.7000 767.0689 775.9882 835.9969 861.4254 870.2292 909.1155 917.2369 939.3447 951.4429 960.9321 995.0386 1010.8730 1042.2113 1051.6872 1087.8667 1110.2580 1112.7866 1113.5882 1149.9934 1155.6849 1166.3921 1178.1696 1209.8508 1223.8979 1250.2917 1307.9269 1357.2918 1367.8397 1372.0156 1391.3571 1392.3098 1403.2470 1421.7180 1440.4439 1449.7125 1453.3490 1456.7207 1458.8634 1459.7704 1469.2362 1476.0586 1478.4386 1482.9192 1486.3314 1490.8274 1557.7795 1603.1536 1640.3106 2966.3998 2972.0579 2977.6532 2982.0331 2994.0355 3051.7131 3063.2477 3071.4293 3081.5829 3091.3161 3094.3408 3105.3009 3110.2106 3113.3582 3120.2038 3123.5823 3152.7810 3181.9525
redmass: 3.4124 3.0893 3.6765 2.7374 3.0675 2.7092 1.1927 1.0759 1.0639 1.0417 3.0009 2.5186 4.2238 1.2030 3.1105 3.1691 3.8632 3.6478 3.9822 3.4747 3.7538 3.9804 4.5199 4.6892 4.4988 4.5152 3.3615 4.5436 6.4946 4.8898 3.2265 5.8157 2.6139 4.0617 2.6420 4.1405 2.7047 1.6315 5.6713 1.5864 1.8058 4.4687 1.3086 1.3127 5.6588 1.4981 2.0628 3.9648 1.3929 1.3588 1.3281 1.3827 1.4124 1.9340 1.8592 2.5654 2.3380 2.5873 7.0158 5.6133 1.6069 1.5264 1.2856 1.2125 2.1362 1.2901 1.5269 1.0990 1.6929 1.0619 1.0507 1.1213 1.1799 1.1630 1.1560 1.0707 1.0526 1.0487 9.9956 7.4008 7.6129 1.0308 1.0315 1.0394 1.0345 1.0355 1.0967 1.1037 1.1026 1.0995 1.1010 1.0993 1.1007 1.0966 1.1027 1.1033 1.0854 1.0988 1.0925
irintensity: 1.1380 3.3108 1.1373 4.4676 5.6685 4.5461 1.2114 0.2242 0.3250 0.1030 1.4172 1.6241 5.1240 0.6297 1.4976 1.0976 9.7393 7.0270 2.3010 2.8356 0.5130 6.3384 10.0926 2.5837 1.7951 2.6574 2.5739 2.2082 3.3618 3.8171 20.9621 4.1124 13.5100 6.5604 25.1466 7.3479 12.6425 23.9647 27.3202 1.1061 4.1617 91.6788 2.2825 0.3305 47.5556 1.3516 146.3840 40.6496 98.8707 26.5853 8.8739 6.1715 11.8458 21.9112 75.5812 28.1589 13.3580 63.2655 74.0746 28.5799 23.8146 20.9012 22.3279 20.7481 24.8240 0.5160 52.7376 9.3678 6.7184 15.0327 1.9077 0.5824 4.7957 27.6993 44.0595 19.5477 23.7477 14.2518 31.4723 85.7626 27.1678 77.8969 85.0995 27.0628 17.5461 25.4146 18.3237 29.0378 25.5808 10.1421 23.4941 26.9452 27.5104 8.8541 27.2395 25.1292 1.5186 24.0325 0.3024
temp: 298.150 k
press: 1.00000 atm
elementType: 8 8 8 6 6 6 6 6 6 6 6 6 6 6 6 6 6 1 1 1 1 1 1 1 1 1 1 1 1 1 1 1 1 1 1
symmnumber: 1
zpe: 751022.9 jmol-1
zpe.correction: 0.286050 hartree
zpe.thermalcorrener: 0.304055 hartree
zpe.thermalcorrenthalpy: 0.304999 hartree
zpe.thermalcorrgfe: 0.241234 hartree
zpe.sumelectzpe: -768.633309 hartree
zpe.sumelectthermal: -768.615304 hartree
zpe.sumelectthermalent: -768.614360 hartree
zpe.sumelectthermalfe: -768.678125 hartree
dipole: -0.4143 1.3985 0.8429
dipole: 1.6846
quadrupole: -84.1975 -97.3753 -103.3811
quadrupole: -2.1686 -2.5805 -5.4216
quadrupole: 10.7871 -2.3907 -8.3965 -2.1686 -2.5805 -5.4216
hfenergy: -768.9193586 hartree
pointgroup: C01 [X(C14H18O3)]
dipole: -0.1744251 0.5215419 0.369898 debye
polarizability: 248.3747001|-8.2790489|161.9332584|7.9003458|6.9732499|103.8125181 unknown
InChI: InChI=1S/C14H18O3/c1-9-10-6-7-14(2,3)17-11(10)8-12(15-4)13(9)16-5/h6-8H,1-5H3
charge 0 multiplicity 1
35 atoms
O  -2.069227 -0.952633 -0.826345
O  3.135796 0.799458 0.459716
O  2.626345 -1.904067 -0.407303
C  -3.275482 -0.241192 -0.251835
C  -0.584381 0.854423 -0.030192
C  -0.797988 -0.493468 -0.448121
C  -3.011287 1.256012 -0.173518
C  0.740545 1.292187 0.273748
C  -1.748017 1.747145 -0.023448
C  -4.407345 -0.583434 -1.233566
C  -3.535863 -0.830544 1.155534
C  0.27001 -1.402022 -0.567806
C  1.813356 0.373903 0.150814
C  1.573802 -0.973808 -0.251749
C  1.015444 2.721551 0.70568
C  4.009913 0.926131 -0.729214
C  3.38097 -2.214973 0.829498
H  -3.884367 1.918254 -0.207857
H  -1.584781 2.825481 0.075146
H  -4.519757 -1.678044 -1.315837
H  -5.363116 -0.156473 -0.87959
H  -4.185628 -0.177909 -2.23496
H  -2.674592 -0.641949 1.820013
H  -4.428641 -0.362467 1.609385
H  -3.702347 -1.920503 1.087076
H  0.095408 -2.431726 -0.888401
H  0.427568 2.990962 1.602466
H  2.082776 2.844267 0.943911
H  0.750384 3.444275 -0.089878
H  3.612211 1.695153 -1.41917
H  4.094124 -0.041876 -1.256034
H  4.992602 1.23991 -0.343641
H  2.715459 -2.709339 1.562769
H  3.811588 -1.298178 1.269111
H  4.175918 -2.909909 0.518297
