program: Gaussian 09
title: 000189522
version: EM64L-G09RevD.01
frameworkgroup: C1[X(C13H16O2)]
method: RPBEPBE
basis: SDD
operation: Freq
keyword: #pfreq=noraman
keyword: PBEPBE/SDD
title: #p freq=noraman PBEPBE/SDD
converged: YES YES NO NO
title: Mulliken charges:
elementType: O O C C C C C C C C C C C C C H H H H H H H H H H H H H H H H
charge: -0.272517 -0.267461 -0.376966 -0.572309 -0.362259 0.560200 -0.459805 -0.523419 0.198154 -0.420935 0.160264 -0.332338 -0.202249 -0.033352 -0.596676 0.207803 0.212606 0.209279 0.204958 0.211398 0.193994 0.206673 0.200681 0.256393 0.236059 0.247301 0.234814 0.235266 0.212458 0.214393 0.217592
chargesum: 0.00000
title: Mulliken charges with hydrogens summed into heavy atoms:
elementType: O O C C C C C C C C C C C C C
charge: -0.272517 -0.267461 0.043443 -0.158072 0.043134 0.560200 -0.052452 -0.267026 0.198154 -0.184876 0.160264 -0.085037 0.267831 0.179106 -0.164691
polarizability: 2.14451214e+02 1.68192900e+01 1.30132518e+02 1.28023788e+01 -9.07540453e+00 9.61725308e+01
1716.lowfreq: -59.0577 -6.2369 -0.7743 0.0005 0.0007 0.0008 5.7276 15.1392 32.4015
frequency: -59.0499 13.9542 32.3479 43.6105 62.2206 107.1557 116.4338 139.4956 182.6537 222.2302 277.3044 282.1060 325.4660 391.8818 411.2889 426.5931 442.5726 508.4752 592.4985 620.3932 641.7315 678.5978 717.8597 732.2086 750.4792 774.3369 783.5024 816.1002 842.0788 872.9352 886.6281 910.9015 920.4481 931.1127 940.3557 977.3378 999.0485 1009.7303 1022.0248 1048.6835 1057.7819 1065.5538 1065.7416 1086.5964 1119.0337 1132.5982 1179.3529 1183.1687 1227.8509 1240.2154 1251.7077 1268.6335 1277.8533 1286.9041 1289.1529 1294.8589 1329.3064 1346.6856 1365.0862 1397.6153 1424.3595 1439.2042 1458.6972 1464.4776 1472.6945 1476.9121 1486.8238 1487.9049 1610.5204 1630.5894 1657.4368 2953.9198 2962.2751 2969.1481 2979.2549 3003.2060 3008.4697 3016.4661 3032.9799 3051.0737 3071.0738 3084.8801 3089.8373 3135.4625 3160.4606 3179.1026 3193.5784
redmass: 2.3543 3.9757 2.7828 3.6149 2.9625 2.6229 2.0660 2.9437 4.5121 6.1032 3.8305 2.8918 3.4777 3.3142 3.3255 2.6765 2.8211 4.7869 5.3738 2.8297 2.0162 9.4342 4.2846 1.0851 4.7224 2.8867 1.5670 1.4207 9.8446 1.4854 1.4587 2.8989 2.0875 1.3503 1.3364 5.4794 1.1542 2.0045 2.6117 3.0003 3.6559 2.4947 1.4603 1.3519 1.0363 1.3514 1.8034 1.6735 1.2714 1.3588 4.1655 1.3316 1.2034 1.1370 1.2462 1.2866 1.4094 1.5391 1.2731 4.0312 1.1795 4.7534 1.0952 1.0846 1.1403 2.1243 1.1105 1.2752 7.8372 8.3720 4.7656 1.0616 1.0606 1.0597 1.0601 1.0955 1.0533 1.0990 1.1021 1.1041 1.0794 1.1189 1.0742 1.0898 1.0928 1.0955 1.1145
irintensity: 14.8451 0.0011 0.0640 0.0313 0.0334 0.1042 0.0644 0.1186 0.0386 0.1478 0.2033 1.3061 0.5659 1.7539 6.3675 3.7339 1.8904 3.6076 2.6656 3.0607 20.2429 0.6705 2.2252 5.9401 11.4644 15.1170 2.5166 38.4295 31.0312 18.5566 5.3376 2.0742 1.7569 1.0934 82.0560 148.0417 9.5720 5.7347 2.3154 1.5060 14.2910 0.1322 4.4073 9.9101 0.0014 7.4905 27.6301 33.0881 18.4728 1.9052 167.8868 1.0016 2.1173 1.0384 1.4325 1.6533 4.2055 0.1132 0.5941 11.1957 3.6781 41.8929 4.5632 3.2607 6.1191 137.1476 22.6493 22.8350 7.2401 0.8756 22.1680 12.7468 17.3424 10.1412 91.9936 6.0278 131.5626 1.3456 2.8372 84.6945 47.0227 36.0787 7.9103 12.3710 4.5073 5.2614 33.4846
temp: 298.150 k
press: 1.00000 atm
elementType: 8 8 6 6 6 6 6 6 6 6 6 6 6 6 6 1 1 1 1 1 1 1 1 1 1 1 1 1 1 1 1
symmnumber: 1
zpe: 672428.6 jmol-1
zpe.correction: 0.256115 hartree
zpe.thermalcorrener: 0.270321 hartree
zpe.thermalcorrenthalpy: 0.271265 hartree
zpe.thermalcorrgfe: 0.211931 hartree
zpe.sumelectzpe: -654.258158 hartree
zpe.sumelectthermal: -654.243952 hartree
zpe.sumelectthermalent: -654.243007 hartree
zpe.sumelectthermalfe: -654.302342 hartree
dipole: -0.0641 -0.1926 0.1187
dipole: 0.2352
quadrupole: -86.9653 -87.8271 -91.4209
quadrupole: 4.1537 3.2113 -1.2908
quadrupole: 1.7725 0.9107 -2.6831 4.1537 3.2113 -1.2908
hfenergy: -654.5142729 hartree
pointgroup: C01 [X(C13H16O2)]
dipole: -0.024916 -0.0784302 0.0423202 debye
polarizability: 214.0679571|16.7114478|131.2597737|14.4037668|-6.9624291|95.4285325 unknown
InChI: InChI=1S/C13H16O2/c1-2-3-4-5-6-11-7-8-12-13(9-11)15-10-14-12/h2,7-9H,1,3-6,10H2
charge 0 multiplicity 1
31 atoms
O  -3.524306 -1.703771 -0.052321
O  -4.458241 0.407098 -0.729213
C  1.950343 -0.012267 0.007457
C  0.959963 0.339076 1.153062
C  3.416159 -0.089636 0.487307
C  -0.485263 0.412989 0.679933
C  4.40452 -0.429938 -0.660858
C  -1.267816 -0.778698 0.595739
C  -2.571453 -0.664425 0.111082
C  -1.04979 1.650871 0.278033
C  -3.119085 0.572735 -0.286152
C  -2.380587 1.755294 -0.214244
C  -4.749147 -1.043836 -0.579561
C  5.834853 -0.565034 -0.182421
C  6.888097 0.162481 -0.632988
H  1.65345 -0.980349 -0.44479
H  1.858331 0.746813 -0.795177
H  1.261932 1.307637 1.597215
H  1.061895 -0.422651 1.951639
H  3.71262 0.875056 0.945959
H  3.503745 -0.855704 1.285942
H  4.342869 0.346844 -1.447775
H  4.079675 -1.38443 -1.127851
H  -0.862527 -1.746911 0.904801
H  -0.442078 2.559911 0.352474
H  -2.809405 2.713849 -0.517185
H  -5.568127 -1.172848 0.14961
H  -4.986294 -1.467452 -1.570886
H  6.005828 -1.319917 0.602518
H  7.900525 0.016066 -0.23962
H  6.765714 0.926451 -1.411232
