program: Gaussian 09
title: 000189512
version: EM64L-G09RevD.01
frameworkgroup: C1[X(C16H25F3O)]
method: RPBEPBE
basis: SDD
operation: Freq
keyword: #p
keyword: freq=noraman
keyword: PBEPBE/SDD
title: #p freq=noraman PBEPBE/SDD
converged: YES YES NO NO
title: Mulliken charges:
elementType: F F F O C C C C C C C C C C C C C C C C H H H H H H H H H H H H H H H H H H H H H H H H H
charge: -0.156110 -0.133980 -0.156017 -0.144286 -0.384793 -0.385312 -0.387168 -0.381688 -0.375048 -0.373074 -0.378415 -0.353122 -0.374749 -0.356763 -0.507413 -0.696385 0.221119 -0.133767 0.041208 0.341191 0.195361 0.192531 0.193021 0.195496 0.199309 0.193450 0.191331 0.192731 0.198773 0.190111 0.190454 0.189292 0.193197 0.223326 0.187156 0.187994 0.217970 0.212748 0.194598 0.195363 0.255993 0.249846 0.209815 0.209332 0.215377
chargesum: 0.00000
title: Mulliken charges with hydrogens summed into heavy atoms:
elementType: F F F O C C C C C C C C C C C C C C C C
charge: -0.156110 -0.133980 -0.156017 -0.144286 0.003099 0.003205 0.005592 0.002374 0.013836 0.006672 0.038108 0.022028 0.055968 0.033197 -0.001574 -0.061861 0.221119 -0.133767 0.041208 0.341191
polarizability: 2.21505806e+02 1.07220824e+01 1.89070504e+02 -8.65530598e-02 7.50726102e+00 1.37444520e+02
1716.lowfreq: -25.2196 -3.0309 -0.4848 -0.0010 -0.0008 0.0007 6.6530 9.4066 11.3190
frequency: -21.1829 8.8189 10.4326 22.2871 25.6868 33.0005 50.3110 52.4515 66.0912 86.8011 90.1512 101.3090 119.1850 125.7675 142.4437 146.9683 166.3511 175.9219 180.4449 229.7572 230.2321 248.2509 261.5418 315.1203 354.3957 367.2237 375.2244 385.7447 406.9592 449.9051 462.8156 479.6602 493.1641 547.2693 614.7943 658.0198 715.2782 719.0365 721.3556 727.4830 740.8226 765.1825 800.5887 830.2464 838.0574 874.8362 887.3403 924.3490 960.9686 981.7716 983.8868 1005.7956 1006.5648 1023.1541 1026.2777 1049.2326 1062.9167 1067.7533 1075.1730 1079.5705 1080.7844 1083.4435 1110.9241 1120.9968 1123.7232 1180.8896 1187.2694 1204.9825 1214.9810 1232.9625 1243.0016 1244.2714 1258.6174 1269.4726 1278.4539 1279.3552 1286.3451 1290.1773 1294.4933 1296.3287 1299.0011 1315.5856 1322.8135 1340.1654 1351.2251 1353.1076 1355.6538 1360.3537 1386.7789 1433.3370 1457.9857 1458.1288 1460.9044 1461.7753 1463.3883 1466.2635 1471.4722 1476.6589 1476.9653 1481.7938 1485.7432 1487.8796 1594.9854 2244.1138 2948.2549 2948.6749 2950.0912 2951.4467 2953.1001 2957.0633 2960.9705 2965.0163 2967.7023 2969.2996 2971.0611 2981.8918 2985.2285 2986.0704 2990.2350 2996.5547 3005.9647 3014.6534 3018.7688 3025.1698 3034.5222 3042.1666 3055.0983 3067.8094 3070.0805
redmass: 1.5787 12.7359 5.6712 4.5609 11.7463 3.8372 2.2362 3.0566 4.1660 3.1269 2.1581 2.7015 2.4894 2.5539 2.1494 2.0840 3.2590 2.9532 4.3830 4.1844 1.2828 7.2313 3.3988 4.2458 6.7986 4.5420 6.2120 4.4362 3.7060 13.7046 4.1860 3.5082 3.9529 3.9890 8.5439 8.6819 12.3711 1.0586 1.0685 1.0897 1.1431 1.2347 1.3770 1.9664 2.0818 1.4566 1.9035 1.3379 2.5921 1.5001 3.8509 3.4264 8.9417 3.6986 1.1377 3.0276 3.0404 9.4198 2.4313 2.3795 2.1415 2.2743 1.6859 3.0803 3.3990 1.7229 1.3331 1.5131 1.3324 1.3911 1.4668 3.1879 1.3238 1.2748 1.0318 1.2210 1.0506 1.1649 1.1085 1.1900 1.1613 1.3908 1.4448 1.4411 1.6182 1.6254 1.6404 1.5754 1.2166 1.0855 1.0734 1.0738 1.0705 1.0724 1.0641 1.0832 1.0852 1.0607 1.0677 1.0902 1.0936 1.0922 13.0481 11.8726 1.0585 1.0585 1.0590 1.0590 1.0594 1.0595 1.0594 1.0592 1.0585 1.0593 1.0365 1.0961 1.0914 1.0677 1.0977 1.1004 1.1022 1.1025 1.0981 1.1043 1.1048 1.1046 1.1044 1.1007 1.0993
irintensity: 0.0658 0.0114 0.4712 0.2071 0.5334 0.6204 0.0388 0.0929 0.3149 0.1861 0.0940 0.1207 0.0500 0.1033 0.0119 0.0295 0.2689 0.2107 0.4511 4.3284 0.8012 3.3254 0.5132 0.6649 2.6844 0.9761 5.3618 1.3764 0.6733 4.0310 0.9959 0.4214 0.7515 7.5751 26.6333 9.1172 15.4374 18.4763 0.1468 7.6878 1.5092 9.4548 13.9556 7.5879 67.9417 27.4911 5.3349 19.2373 35.3020 0.6295 1.6162 47.7241 197.0894 1.4618 0.2291 11.0296 5.8881 165.7630 18.1149 2.8260 1.8055 2.3312 10.1193 68.7472 88.3183 1.6948 6.2190 2.2096 5.5095 0.1720 0.6562 0.4806 0.1451 0.2531 0.1135 0.2853 0.4431 0.2920 0.0293 0.1458 0.2265 4.2316 5.7572 1.8814 1.9648 1.1067 0.1878 6.0809 11.1134 25.0111 0.1438 0.0078 0.2733 0.0408 0.4713 0.8647 0.7975 8.0318 5.9344 1.7382 6.0856 36.8969 194.4853 351.7982 0.0214 0.2153 0.0951 1.4212 2.4900 1.5725 9.9304 74.7878 208.9479 24.3479 36.3379 0.5161 4.9142 43.7411 2.5957 0.7394 0.3926 1.1332 10.2637 5.0968 2.3551 205.8030 111.0911 99.0938 54.8484
temp: 298.150 k
press: 1.00000 atm
elementType: 9 9 9 8 6 6 6 6 6 6 6 6 6 6 6 6 6 6 6 6 1 1 1 1 1 1 1 1 1 1 1 1 1 1 1 1 1 1 1 1 1 1 1 1 1
symmnumber: 1
zpe: 983668.9 jmol-1
zpe.correction: 0.374660 hartree
zpe.thermalcorrener: 0.398590 hartree
zpe.thermalcorrenthalpy: 0.399534 hartree
zpe.thermalcorrgfe: 0.313988 hartree
zpe.sumelectzpe: -997.794547 hartree
zpe.sumelectthermal: -997.770617 hartree
zpe.sumelectthermalent: -997.769673 hartree
zpe.sumelectthermalfe: -997.855218 hartree
dipole: 3.2727 4.8086 0.7200
dipole: 5.8610
quadrupole: -151.6335 -119.3099 -122.6720
quadrupole: -18.6158 -1.0177 -0.5602
quadrupole: -20.4283 11.8952 8.5332 -18.6158 -1.0177 -0.5602
hfenergy: -998.1692066 hartree
pointgroup: C01 [X(C16H25F3O1)]
dipole: 1.2797127 1.8343174 0.5609995 debye
polarizability: 221.3694421|11.0154152|185.6815335|0.6804846|14.9660639|140.9698539 unknown
InChI: InChI=1S/C16H25F3O/c1-2-3-4-5-6-7-8-9-10-11-12-13-14-15(20)16(17,18)19/h2-12H2,1H3
charge 0 multiplicity 1
45 atoms
F  -7.442417 -0.257068 -0.462832
F  -7.104461 -2.500639 -0.467896
F  -6.628465 -1.291869 1.392304
O  -4.560567 -1.91111 -1.253407
C  2.947426 1.140713 -0.164759
C  4.003192 0.121595 0.319776
C  1.54497 0.903712 0.439146
C  5.404369 0.358024 -0.287561
C  0.494179 1.929338 -0.042519
C  6.462348 -0.659236 0.196552
C  -0.910566 1.686386 0.553116
C  7.863114 -0.422565 -0.411797
C  -1.94558 2.72836 0.077787
C  8.921089 -1.441407 0.070436
C  -3.368135 2.503462 0.667015
C  10.317689 -1.195416 -0.540688
C  -3.993943 1.243233 0.25469
C  -4.541099 0.187679 -0.095895
C  -5.117213 -1.048138 -0.529764
C  -6.579007 -1.288474 -0.022205
H  2.880847 1.099477 -1.272199
H  3.287148 2.167193 0.087962
H  4.072121 0.163345 1.427154
H  3.663708 -0.905065 0.06851
H  1.203007 -0.120065 0.180844
H  1.612055 0.939149 1.546748
H  5.743506 1.385392 -0.037736
H  5.335438 0.314944 -1.394867
H  0.432524 1.896457 -1.150292
H  0.834918 2.952865 0.220634
H  6.12364 -1.686649 -0.053311
H  6.532115 -0.616478 1.303905
H  -0.849058 1.706556 1.661415
H  -1.256002 0.670181 0.275305
H  8.204293 0.603914 -0.16092
H  7.794641 -0.464384 -1.519251
H  -2.004393 2.719651 -1.027648
H  -1.616225 3.743771 0.374054
H  8.987445 -1.400758 1.177046
H  8.580657 -2.46642 -0.182372
H  -4.040054 3.335875 0.374695
H  -3.319947 2.523185 1.77544
H  10.283417 -1.260095 -1.644801
H  10.693814 -0.188922 -0.276209
H  11.055065 -1.936892 -0.181504
