program: Gaussian 09
title: 000017446
version: EM64L-G09RevD.01
frameworkgroup: C1[X(C9H14N2O)]
method: RPBEPBE
basis: SDD
operation: Freq
keyword: #p
keyword: freq=noraman
keyword: PBEPBE/SDD
title: #p freq=noraman PBEPBE/SDD
converged: YES YES NO NO
title: Mulliken charges:
elementType: O N N C C C C C C C C C H H H H H H H H H H H H H H
charge: -0.277793 -0.302038 -0.577884 0.233848 -0.278451 0.305732 -0.367628 -0.358114 -0.385781 -0.785443 -0.242140 -0.247939 0.188671 0.227387 0.246480 0.199889 0.245906 0.229887 0.235811 0.238186 0.211475 0.222254 0.223794 0.246320 0.267177 0.300393
chargesum: 0.00000
title: Mulliken charges with hydrogens summed into heavy atoms:
elementType: O N N C C C C C C C C C
charge: -0.277793 -0.055718 -0.010314 0.233848 0.137608 0.305732 0.078741 -0.112207 -0.155894 -0.099971 -0.019886 -0.024146
polarizability: 1.61092592e+02 5.44172863e+00 1.19688712e+02 -1.42004633e+00 5.13541750e-01 6.51171298e+01
1716.lowfreq: -6.6558 -3.2443 0.0008 0.0008 0.0009 13.0618 34.8849 57.2710 79.5433
frequency: 34.8485 57.2624 79.5282 85.8024 101.9689 149.6626 177.3779 213.5222 235.8316 268.6640 336.2930 376.6778 411.2371 444.0985 461.3744 519.0446 524.3494 542.8241 593.6728 711.0783 718.3088 754.9032 755.7111 813.9189 833.3255 853.4159 926.3318 970.6886 978.9006 982.4622 1018.4129 1046.3591 1048.7856 1087.9249 1117.4613 1125.6893 1161.8730 1171.5916 1186.5808 1192.4462 1232.8607 1240.9511 1268.7644 1286.0321 1316.5750 1377.7753 1393.5358 1398.9847 1429.0980 1455.5712 1468.8080 1475.1400 1476.8188 1489.1059 1495.6212 1596.5401 1608.9088 1650.9432 2911.9869 2945.6272 2981.6067 3026.4648 3059.5193 3089.3101 3089.6780 3120.6302 3132.4543 3154.9454 3169.2252 3350.3199 3422.6744 3599.2670
redmass: 3.9597 3.0458 2.4027 1.8387 1.4005 2.3498 3.5206 3.0916 4.7057 4.0722 2.4263 1.5802 1.5146 2.8888 2.1317 3.7282 5.1589 3.4562 6.3876 1.5030 2.3687 3.8414 1.4776 4.6020 1.2187 1.2679 1.3617 1.3101 3.1945 2.1213 2.4212 1.5266 2.0711 2.9818 1.8861 1.7913 2.1990 1.1035 1.2107 2.4573 3.0160 1.6646 1.1679 1.4511 1.2562 2.4839 1.8409 1.4136 1.9740 1.0459 1.1530 1.3323 1.1435 1.4518 1.3102 6.8910 6.1326 1.0856 1.0713 1.0605 1.0362 1.1003 1.0968 1.0918 1.1001 1.0866 1.0891 1.0942 1.0980 1.0744 1.0466 1.0977
irintensity: 1.9083 2.3498 5.0906 1.6704 1.3518 7.6474 2.5019 3.6049 1.3932 1.3810 20.9770 84.5087 158.9303 4.8892 38.9852 12.0152 5.1744 0.2416 7.6062 85.2578 11.5050 13.9249 89.3307 3.7534 1.6190 0.6332 1.6238 0.1523 50.0875 23.7511 3.1534 7.3624 18.4270 1.2851 70.1719 2.0017 2.8871 8.6454 7.3189 64.4440 139.1421 10.6830 0.7017 0.1318 0.5050 1.2518 9.2992 14.7121 22.7725 12.7705 8.3764 26.0178 32.9134 60.5237 5.7412 9.6757 37.5826 5.5483 72.0379 49.9034 30.0399 34.4916 19.3724 22.5105 22.7478 8.5015 15.1070 38.7470 13.5491 19.4473 21.9263 3.4345
temp: 298.150 k
press: 1.00000 atm
elementType: 8 7 7 6 6 6 6 6 6 6 6 6 1 1 1 1 1 1 1 1 1 1 1 1 1 1
symmnumber: 1
zpe: 572927.2 jmol-1
zpe.correction: 0.218216 hartree
zpe.thermalcorrener: 0.231210 hartree
zpe.thermalcorrenthalpy: 0.232154 hartree
zpe.thermalcorrgfe: 0.177839 hartree
zpe.sumelectzpe: -535.104173 hartree
zpe.sumelectthermal: -535.091179 hartree
zpe.sumelectthermalent: -535.090235 hartree
zpe.sumelectthermalfe: -535.144550 hartree
dipole: 2.1510 -0.7553 1.4844
dipole: 2.7204
quadrupole: -56.4137 -68.6191 -74.6241
quadrupole: -2.7299 6.4697 0.1810
quadrupole: 10.1386 -2.0668 -8.0718 -2.7299 6.4697 0.1810
hfenergy: -535.3223891 hartree
pointgroup: C01 [X(C9H14N2O1)]
dipole: 0.8187636 0.2765195 -0.6313846 debye
dipolederiv: -1.9158064 -0.0468578 0.0477894 0.048236 -0.3178993 0.0090993 0.0222584 0.0081275 -0.2713665 -0.1042002 -0.0593363 0.1517907 -0.0182696 -0.4604084 -0.248472 -0.0721765 -0.1898032 -0.0128867 -0.2115606 -0.1544474 0.022011 -0.1002334 -0.2627878 0.383517 0.2261961 0.3071059 -0.4460212 1.4933591 -0.128968 -0.0166635 -0.3923234 -0.0215567 0.0209912 0.0162557 0.0120031 0.070571 0.8401782 0.1399301 -0.0221869 0.5046704 0.3024022 -0.015679 -0.0774372 -0.033037 0.4085528 -0.343154 -0.0291692 0.0100982 -0.2123082 0.2882366 -0.0350513 0.0319896 -0.0388786 -0.0515287 0.3434915 0.1719104 -0.0196857 0.0864125 0.3497588 0.1054807 -0.1313564 0.0778377 0.206443 -0.2411218 -0.0401725 0.0064246 0.3161572 -0.0671582 -0.0216352 -0.0326356 -0.0117573 -0.2047412 0.1218853 0.0518264 -0.0116498 -0.0073045 0.0459009 -0.0235128 -0.0053424 -0.0254492 -0.1694468 0.0434395 0.141484 -0.0155968 0.1057147 -0.0726936 0.0141898 -0.0127302 0.0157032 0.0645553 0.0904968 0.0845698 -0.014611 -0.0517178 0.0980675 -0.0273088 0.0002948 -0.0294161 -0.1614302 -0.0220032 -0.0690492 0.0039883 0.0135508 -0.1612562 -0.0030971 -0.0059351 -0.0011279 -0.1873855 -0.0264877 0.0057967 -0.0307418 -0.1047805 -0.0295045 0.0925753 0.0331711 0.1140394 -0.137977 -0.0105567 0.0281569 0.0330187 -0.0783613 -0.071336 -0.0891125 0.0294377 -0.0998999 -0.0480086 0.0776754 -0.0024638 -0.0319936 -0.0062805 0.0406108 0.0517181 -0.0100621 0.0656781 -0.0748679 -0.0233635 -0.0457262 0.0110557 -0.0789087 -0.1719256 -0.1114767 -0.0053621 -0.1572137 -0.0397812 -0.0052902 -0.1058705 0.015461 -0.1178754 0.0051798 0.0196326 0.0152884 0.0190635 0.1619951 -0.01826 -0.0962754 0.0141937 -0.1245172 -0.0397043 0.0231073 0.0168602 0.0226809 0.1475678 0.0518767 0.070475 0.1025351 0.0447993 0.0156687 -0.0199743 0.0967767 -0.080566 -0.0332155 0.0485403 0.0477356 -0.1156676 0.0227961 0.0335599 0.0052349 -0.1048025 0.06344 -0.0458899 -0.0860553 -0.1747364 0.0205827 -0.0677568 -0.021792 0.0141197 0.0097838 0.015391 0.1038709 0.0567571 0.0511474 -0.003397 0.0730646 -0.1184669 0.0288809 -0.0055296 0.0292618 0.1563072 -0.1340116 0.0614061 -0.0003929 0.05317 0.066825 0.0101601 0.0005147 0.0098907 0.1690629 0.0135093 0.0068036 -0.0854209 -0.019612 0.2503658 0.0736317 -0.0774035 0.162881 -0.0812438 -0.0723539 0.1057428 0.0001215 0.1533467 0.190415 -0.1411644 0.0457151 -0.1840021 0.1569604 0.0330158 -0.0139122 -0.0710631 -0.041669 0.1294984 -0.1158547 -0.003769 -0.0719528 0.3199045 unknown
polarizability: 161.6209898|-2.8393415|118.5929395|0.4455933|-5.640581|65.6845047 unknown
InChI: InChI=1S/C9H14N2O/c1-8-4-2-3-5-9(8)12-7-6-11-10/h2-5,11H,6-7,10H2,1H3
charge 0 multiplicity 1
26 atoms
O  0.50617 -0.559451 -0.07499
N  3.999748 0.641444 -0.42136
N  5.282071 0.204161 0.00392
C  -0.829976 -0.115198 -0.097075
C  1.56847 0.448903 -0.206067
C  -1.808253 -1.145481 0.03549
C  2.902349 -0.304314 -0.119584
C  -1.206696 1.24193 -0.238899
C  -3.168763 -0.765619 0.021915
C  -1.3747 -2.588993 0.18711
C  -2.578147 1.58762 -0.248146
C  -3.563832 0.587451 -0.117887
H  1.468463 0.972514 -1.181938
H  1.499183 1.198718 0.605682
H  3.065426 -0.67634 0.904179
H  2.864219 -1.189142 -0.797458
H  -0.45185 2.027408 -0.33897
H  -3.931436 -1.54731 0.123486
H  -0.759895 -2.913408 -0.672627
H  -0.743893 -2.722902 1.085309
H  -2.248618 -3.25785 0.267803
H  -2.868009 2.638855 -0.356453
H  -4.626496 0.852259 -0.12396
H  3.97028 0.978253 -1.397655
H  5.80697 -0.42909 -0.610516
H  5.829714 0.93078 0.464393
