program: Gaussian 09
title: 000189510
version: EM64L-G09RevD.01
frameworkgroup: C1[X(C12H17F3O)]
method: RPBEPBE
basis: SDD
operation: Freq
keyword: #p
keyword: freq=noraman
keyword: PBEPBE/SDD
title: #p freq=noraman PBEPBE/SDD
converged: YES YES NO NO
title: Mulliken charges:
elementType: F F F O C C C C C C C C C C C C H H H H H H H H H H H H H H H H H
charge: -0.156639 -0.158122 -0.133023 -0.140947 -0.370736 -0.373180 -0.376460 -0.352618 -0.375820 -0.356281 -0.501557 -0.695619 0.209716 -0.130908 0.045239 0.340266 0.197121 0.188660 0.196537 0.188933 0.222696 0.192768 0.189631 0.186476 0.219510 0.212093 0.194548 0.197700 0.249275 0.254617 0.216679 0.208917 0.210524
chargesum: 0.00000
title: Mulliken charges with hydrogens summed into heavy atoms:
elementType: F F F O C C C C C C C C C C C C
charge: -0.156639 -0.158122 -0.133023 -0.140947 0.015046 0.012290 0.039005 0.023489 0.055784 0.035967 0.002335 -0.059499 0.209716 -0.130908 0.045239 0.340266
polarizability: 1.70136917e+02 1.51696829e+01 1.41383132e+02 8.51755452e+00 3.91405628e+00 1.01386198e+02
1716.lowfreq: -5.0202 -0.0001 0.0007 0.0010 3.1797 7.8907 9.5009 16.4961 26.9643
frequency: 8.2771 15.8814 26.8236 37.3461 42.4731 67.2968 78.6752 94.0671 120.3778 125.4435 143.4968 179.5352 189.1801 228.4732 232.6524 237.6885 262.5936 317.2905 341.5413 366.6974 382.0606 431.5990 449.4594 456.7618 481.6251 560.6184 601.0467 655.4372 714.4064 721.5771 730.4454 757.4405 805.8452 830.9179 853.1903 890.5726 916.5139 961.4165 998.3899 1004.2290 1012.6821 1035.3822 1057.5076 1066.6550 1078.1270 1080.5695 1109.8405 1116.4159 1123.1896 1185.2048 1193.0494 1228.2686 1237.9813 1241.6359 1266.5135 1279.1134 1282.2019 1293.0307 1295.5780 1312.7309 1321.6917 1347.2002 1357.0439 1362.4998 1389.3663 1433.6235 1460.9647 1462.3269 1464.9610 1470.0819 1477.3057 1477.6639 1484.3373 1488.9767 1598.4992 2245.2223 2951.3004 2952.0367 2957.3901 2963.1423 2968.9383 2970.5441 2971.8372 2985.6965 2986.7276 2994.7804 3009.0517 3019.0436 3023.7656 3037.7233 3055.0010 3068.2149 3071.1705
redmass: 7.5876 10.1190 11.4058 3.3651 1.7918 3.7425 4.2682 1.7261 3.5481 2.8978 2.0839 3.0204 3.1712 7.6737 1.1182 5.8118 6.1089 3.0767 6.2910 13.6937 4.1586 4.0872 13.8936 3.0261 8.1788 3.4785 11.1465 9.9833 12.6245 1.0629 1.1014 1.2223 1.4876 2.5486 1.8282 1.8583 1.3891 2.7743 1.4194 10.4812 2.8479 2.8926 2.9216 9.9499 2.2582 2.2058 1.6817 2.4788 3.8234 1.5334 1.4084 1.3842 1.3073 4.7028 1.2858 1.2536 1.0372 1.1664 1.1024 1.3202 1.4441 1.4757 1.6669 1.5867 1.2178 1.0853 1.0765 1.0728 1.0666 1.0796 1.0672 1.0516 1.0858 1.0930 13.0597 11.8716 1.0589 1.0589 1.0597 1.0598 1.0588 1.0590 1.0367 1.0825 1.0750 1.0984 1.1013 1.0982 1.1028 1.1045 1.1043 1.1007 1.0993
irintensity: 0.3144 0.6152 0.7969 0.0861 0.0965 0.6785 0.3228 0.0190 0.0930 0.0667 0.0430 0.2741 0.0220 4.6646 0.0325 4.6668 2.0929 0.5145 3.2081 2.1518 1.4177 2.1866 4.0756 0.1940 1.2836 2.1164 22.0961 10.4758 16.8726 14.5971 0.9206 11.7733 10.5106 32.4756 49.3423 3.5497 13.2743 38.7980 6.6485 221.4319 8.3203 10.8757 7.4857 172.7910 11.5680 0.7972 9.4971 13.5721 127.7893 0.8496 1.5681 1.2613 3.5302 0.3724 0.1687 0.2361 0.4884 0.9226 0.5007 3.8795 6.9929 2.2921 0.9274 6.7432 11.0098 22.9980 0.6143 0.0545 0.5364 1.3910 5.4964 8.9276 2.5481 27.7616 245.5171 347.4955 1.1714 1.9184 3.6421 22.7456 122.6471 27.3547 32.1886 13.1237 37.7332 1.4365 0.6932 8.8417 2.6972 75.3334 89.6396 97.4363 52.5585
temp: 298.150 k
press: 1.00000 atm
elementType: 9 9 9 8 6 6 6 6 6 6 6 6 6 6 6 6 1 1 1 1 1 1 1 1 1 1 1 1 1 1 1 1 1
symmnumber: 1
zpe: 691699.8 jmol-1
zpe.correction: 0.263455 hartree
zpe.thermalcorrener: 0.282540 hartree
zpe.thermalcorrenthalpy: 0.283484 hartree
zpe.thermalcorrgfe: 0.210521 hartree
zpe.sumelectzpe: -840.902320 hartree
zpe.sumelectthermal: -840.883235 hartree
zpe.sumelectthermalent: -840.882291 hartree
zpe.sumelectthermalfe: -840.955254 hartree
dipole: 3.9832 4.1216 0.3749
dipole: 5.7440
quadrupole: -116.7236 -88.0472 -96.6025
quadrupole: -4.9787 -3.9937 0.4539
quadrupole: -16.2658 12.4105 3.8553 -4.9787 -3.9937 0.4539
hfenergy: -841.1657749 hartree
pointgroup: C01 [X(C12H17F3O1)]
dipole: 1.5672187 -1.6263266 -0.0767374 debye
polarizability: 170.3878577|-15.4614892|141.5867338|-6.8242674|2.6092536|100.931654 unknown
InChI: InChI=1S/C12H17F3O/c1-2-3-4-5-6-7-8-9-10-11(16)12(13,14)15/h2-8H2,1H3
charge 0 multiplicity 1
33 atoms
F  -2.699282 1.379243 -1.719789
F  -1.713867 1.848307 0.275692
F  -3.809773 2.599645 -0.161843
O  -4.69411 0.174241 0.733226
C  2.595201 -1.148396 -0.382876
C  3.358205 -0.06834 0.416255
C  1.235106 -1.521135 0.248901
C  4.719044 0.308233 -0.212151
C  0.475778 -2.592857 -0.561761
C  5.479826 1.393093 0.583584
C  -0.892198 -2.990649 0.066712
C  6.839747 1.760695 -0.048629
C  -1.845164 -1.879266 0.144103
C  -2.626791 -0.918368 0.189761
C  -3.530988 0.188079 0.260205
C  -2.94917 1.516982 -0.333101
H  2.430757 -0.78767 -1.419622
H  3.226294 -2.058285 -0.465336
H  2.727571 0.841503 0.495686
H  3.520831 -0.425614 1.454791
H  0.609168 -0.609805 0.333004
H  1.3986 -1.887744 1.283998
H  4.558235 0.663929 -1.251505
H  5.353223 -0.600036 -0.289359
H  0.308427 -2.23187 -1.594755
H  1.090239 -3.511596 -0.637071
H  5.636998 1.039513 1.623187
H  4.847205 2.301182 0.656872
H  -0.732739 -3.38852 1.090103
H  -1.357377 -3.812872 -0.51402
H  7.363519 2.537742 0.537947
H  7.502241 0.876189 -0.105802
H  6.707047 2.146148 -1.077308
