program: Gaussian 09
title: 000189494
version: EM64L-G09RevD.01
frameworkgroup: C1[X(C9H13NO3)]
method: RPBEPBE
basis: SDD
operation: Freq
keyword: #p
keyword: freq=noraman
keyword: PBEPBE/SDD
title: #p freq=noraman PBEPBE/SDD
converged: NO YES NO NO
title: Mulliken charges:
elementType: O O O N C C C C C C C C C H H H H H H H H H H H H H
charge: -0.198501 -0.238126 -0.427666 -0.171958 -0.246442 -0.216064 -0.432898 -0.437590 -0.377996 -0.402270 0.150275 0.163126 -0.301536 0.271007 0.268223 0.217389 0.239257 0.204865 0.239234 0.212417 0.194000 0.214611 0.211057 0.228869 0.260706 0.376013
chargesum: 0.00000
title: Mulliken charges with hydrogens summed into heavy atoms:
elementType: O O O N C C C C C C C C C
charge: -0.198501 -0.238126 -0.051653 -0.171958 0.024565 0.052159 0.023747 0.006509 0.028420 0.023398 0.150275 0.163126 0.188039
polarizability: 1.16979877e+02 -2.67952688e+00 1.15991922e+02 -1.24955555e+00 -5.18033130e-01 8.36780198e+01
1716.lowfreq: -12.9250 -7.6654 -0.0008 -0.0005 0.0003 5.7543 59.7862 73.8545 93.0209
frequency: 59.7368 73.8355 93.0021 131.1291 157.3570 196.8425 248.4408 262.4736 320.1899 340.8696 371.2869 426.5879 452.6058 519.0618 541.5966 571.3650 590.4519 618.4960 680.0432 724.0760 758.9443 795.0756 829.7748 871.9490 884.9994 912.1310 934.9683 972.6100 988.3776 1013.3266 1046.3075 1064.2447 1069.3910 1087.5883 1120.3943 1136.6468 1163.7624 1182.9553 1218.6678 1229.4509 1259.1045 1282.3411 1292.4955 1297.7468 1306.1958 1317.0929 1334.4178 1342.3924 1347.9081 1354.0854 1359.7647 1405.8900 1460.1016 1464.9152 1465.7499 1470.0323 1477.4916 1622.5098 1688.5442 2961.3941 2973.0725 2980.2340 2980.8825 2990.5268 3000.9481 3040.8429 3042.4424 3047.6758 3053.9904 3066.4616 3121.2399 3511.7157
redmass: 4.1720 3.9596 5.3325 3.7338 5.7762 2.9813 2.8643 3.3458 2.1694 4.7663 3.5298 4.0578 3.1497 1.2821 2.5735 3.9223 6.1160 3.3096 4.7801 4.8900 3.1923 2.1908 2.2759 2.4641 2.2111 1.7064 2.4256 2.8348 3.1929 3.7813 2.1665 2.1430 1.7791 1.6057 1.1736 2.6156 2.0807 1.3868 1.3815 1.4433 1.3935 1.8734 1.4867 1.3051 2.3753 1.7253 1.3763 1.3578 1.4321 1.4058 1.4425 1.2819 1.0831 1.0846 1.0891 1.0858 1.0883 10.8864 11.4224 1.0795 1.0655 1.0635 1.0619 1.0648 1.0663 1.0970 1.0979 1.0906 1.1027 1.0959 1.0995 1.0656
irintensity: 2.8263 1.2725 1.8813 4.2610 3.9608 1.2566 4.5936 2.5101 1.6589 21.7052 1.4792 4.9882 2.2511 170.3018 3.9042 51.1582 43.8441 9.9260 38.5562 5.9181 2.9333 4.2128 5.9748 3.2121 18.1948 5.0862 24.7040 82.1932 61.8929 12.8766 5.0772 4.2924 1.0062 36.5536 3.0914 70.6831 72.9877 30.5041 5.5073 0.6045 1.5612 120.3790 15.6587 5.3955 54.7315 25.8811 0.6199 0.3183 1.6896 71.2563 32.6448 29.7395 13.5485 14.4853 14.2139 16.2394 10.9849 464.3401 64.8793 14.5653 26.0731 19.6899 26.9602 31.4374 52.8024 45.9529 39.7536 3.4698 33.0207 46.3865 2.2832 17.6821
temp: 298.150 k
press: 1.00000 atm
elementType: 8 8 8 7 6 6 6 6 6 6 6 6 6 1 1 1 1 1 1 1 1 1 1 1 1 1
symmnumber: 1
zpe: 562132.5 jmol-1
zpe.correction: 0.214105 hartree
zpe.thermalcorrener: 0.225844 hartree
zpe.thermalcorrenthalpy: 0.226788 hartree
zpe.thermalcorrgfe: 0.176152 hartree
zpe.sumelectzpe: -630.206864 hartree
zpe.sumelectthermal: -630.195125 hartree
zpe.sumelectthermalent: -630.194181 hartree
zpe.sumelectthermalfe: -630.244817 hartree
dipole: 3.2336 -0.6487 -1.7520
dipole: 3.7346
quadrupole: -74.5813 -89.1909 -76.4029
quadrupole: 3.9260 4.1664 0.1096
quadrupole: 5.4771 -9.1326 3.6555 3.9260 4.1664 0.1096
hfenergy: -630.4209688 hartree
pointgroup: C01[X(C9H13N1O3)]
dipole: 1.3094067 -0.262589 -0.6126186 debye
dipolederiv: -0.6570399 0.3487186 -0.1083362 0.1864608 -1.0359795 0.1831764 0.0015697 0.0853046 -0.3385662 -0.5861242 -0.18173 0.0851193 -0.0115179 -1.0801209 0.114842 0.1031409 0.2178225 -0.3842388 -0.7092391 -0.1945027 -0.0183707 -0.225924 -0.3206497 0.2021856 0.1998827 0.2103129 -0.6699316 -1.0794004 0.0199805 0.1527829 0.0667167 -1.471045 0.2113709 0.169983 0.2094214 -0.3386594 -0.4327492 0.068392 -0.075864 0.0277563 0.0609771 -0.0324903 -0.1748322 -0.0636029 0.0897158 -0.1795697 -0.0668926 0.0899327 -0.0979577 -0.0198 0.0515662 0.1910512 0.0544752 0.0358214 0.0631039 0.0104837 -0.0068782 0.1216504 0.0693181 -0.005623 0.1334257 0.0413727 0.1354174 0.1646729 -0.0171819 -0.0445336 -0.0358806 0.023841 -0.0085879 -0.0304189 -0.0069203 0.0977208 0.1043244 0.0312032 -0.0292701 -0.0316495 0.0358494 -0.0265543 -0.1121213 -0.0262283 0.106913 0.0824154 0.0058753 -0.0329927 0.0182493 0.0467099 -0.0165107 -0.000207 -0.0131774 0.0851065 0.9888534 0.0672682 0.0849086 0.0211505 1.7240081 -0.3531761 -0.019028 -0.2872377 0.1907245 0.9445574 -0.3463665 -0.1234439 -0.2094317 1.4757136 -0.1815001 -0.2812385 -0.234534 0.2586743 0.9640895 0.2294096 -0.1296954 0.1930057 0.3164387 -0.1402723 -0.2156409 -0.113054 0.7566305 0.0444374 -0.0481478 0.0595936 -0.0313424 0.0039608 0.0577214 0.0524121 0.0570472 -0.0325274 0.0253865 -0.0094126 -0.0417253 -0.0282374 0.0503013 -0.0249222 -0.0557268 -0.0479445 -0.0905554 -0.0343211 -0.0187935 0.0805153 -0.0538828 0.060538 0.0714856 0.0713571 0.0301588 -0.0519729 0.0472374 0.0186742 -0.0254133 0.0001501 -0.1515733 -0.0184628 -0.0320458 0.0043056 0.063249 -0.0998329 0.0079654 0.0945892 -0.0430344 0.0892914 0.0503845 0.0867323 0.0009979 -0.0742588 0.0844235 -0.0482163 -0.0170604 0.0177654 -0.1269783 -0.0330118 -0.0379005 0.0055425 0.0658195 -0.0164923 -0.0375217 -0.0902898 -0.025762 0.0140352 -0.0778685 -0.1263064 -0.1028594 -0.1059401 -0.0473522 -0.028543 0.0875677 -0.0136501 0.0207508 0.0461238 0.1582489 0.0817563 -0.0568073 -0.1476938 0.1114381 -0.0865962 0.0981371 0.0052023 0.0202099 -0.0753981 0.0179669 0.051141 -0.0072524 -0.0672414 0.1337999 -0.0418117 0.0241884 0.0131098 0.0913269 0.0179336 -0.0638 -0.0212964 -0.040519 -0.0077713 -0.1288265 0.0002915 -0.0853406 -0.0400636 -0.0417799 -0.1163121 0.0727809 0.0123649 0.0049598 0.1001516 0.0113086 0.0307942 -0.0028894 0.0062599 0.0776535 0.4320809 0.1732952 -0.0355279 0.1277147 0.1734224 -0.0486496 -0.0553133 -0.1033395 0.3089828 unknown
polarizability: 117.3629523|-2.5496281|114.8145334|0.3360882|-5.1578072|84.4723325 unknown
InChI: InChI=1S/C9H13NO3/c11-5-10-8(12)6-3-1-2-4-7(6)9(10)13/h6-7,11H,1-5H2
charge 0 multiplicity 1
26 atoms
O  -1.508155 2.303497 -0.735927
O  -0.757565 -2.253193 0.026985
O  -2.921751 -0.769765 1.429889
N  -1.443507 -0.031664 -0.340353
C  0.65546 1.01954 -0.719883
C  0.804553 -0.519565 -0.938397
C  1.273463 1.516506 0.628888
C  2.098339 -1.18909 -0.424346
C  2.671104 0.914459 0.88309
C  2.584915 -0.627446 0.930176
C  -0.862792 1.235548 -0.639592
C  -0.498921 -1.08025 -0.352888
C  -2.843818 -0.257531 0.077987
H  1.08268 1.601821 -1.553532
H  0.727494 -0.718726 -2.028847
H  0.610337 1.223881 1.468218
H  1.301093 2.620644 0.614546
H  2.894223 -1.034612 -1.179114
H  1.923093 -2.279074 -0.355209
H  3.070892 1.309369 1.83609
H  3.374696 1.22545 0.083486
H  3.570621 -1.066397 1.173129
H  1.890723 -0.930395 1.739949
H  -3.312453 -0.950911 -0.647371
H  -3.348595 0.719507 0.068271
H  -2.536132 -1.686703 1.429954
