program: Gaussian 09
title: 000189490
version: EM64L-G09RevD.01
frameworkgroup: C1[X(C14H25NO)]
method: RPBEPBE
basis: SDD
operation: Freq
keyword: #p
keyword: freq=noraman
keyword: PBEPBE/SDD
title: #p freq=noraman PBEPBE/SDD
converged: YES YES NO NO
title: Mulliken charges:
elementType: O N C C C C C C C C C C C C C C H H H H H H H H H H H H H H H H H H H H H H H H H
charge: -0.289932 -0.366584 -0.021242 -0.405130 -0.696655 -0.684179 -0.490343 -0.344122 0.211979 -0.351615 -0.418001 -0.461694 -0.692929 -0.302225 -0.289642 0.105526 0.195323 0.254124 0.208054 0.218573 0.200040 0.209962 0.209864 0.232461 0.205216 0.322118 0.230310 0.245340 0.192194 0.208569 0.196109 0.195152 0.202457 0.207388 0.222017 0.236312 0.218424 0.211647 0.210408 0.229491 0.235232
chargesum: 0.00000
title: Mulliken charges with hydrogens summed into heavy atoms:
elementType: O N C C C C C C C C C C C C C C
charge: -0.289932 -0.044466 0.174081 0.057048 -0.068080 -0.036637 -0.014693 0.056640 0.211979 0.039646 -0.008156 -0.003364 -0.052449 -0.072734 -0.054410 0.105526
polarizability: 2.17334794e+02 1.85211459e+01 1.59427795e+02 1.04110969e+01 4.27687571e-01 1.25625159e+02
1716.lowfreq: -17.7208 -10.3941 -0.0010 -0.0005 -0.0005 1.2213 9.3850 20.8000 29.2005
frequency: -10.2422 20.2779 29.1689 34.8192 58.6204 61.5542 71.0756 78.9162 112.4419 113.9288 140.4962 193.6678 211.1873 215.0944 226.2722 229.9443 241.1558 258.9659 261.3063 290.9863 365.1996 368.7329 378.7276 406.9965 467.7823 508.5936 532.4958 566.0894 614.0667 619.1085 664.0186 715.3264 729.0045 780.6258 789.4392 802.2903 843.9404 879.1696 891.8863 906.2304 910.2852 920.5848 942.8700 955.2433 969.0146 976.4394 1017.5279 1033.1695 1043.9497 1063.3407 1072.2516 1101.9179 1109.7445 1123.8016 1146.9278 1148.2559 1171.4276 1187.7655 1204.1602 1211.8209 1242.4131 1259.0576 1267.0924 1274.2300 1276.8788 1287.7558 1305.9814 1309.5880 1323.2118 1331.4088 1332.2286 1346.6863 1363.6391 1375.5377 1391.3917 1396.4733 1416.6755 1445.4653 1448.8811 1455.4558 1458.7970 1461.1840 1466.5085 1473.9019 1476.2924 1478.4772 1478.6912 1486.6261 1487.6080 1505.2470 1608.6975 1995.9890 2959.5940 2961.2327 2962.6813 2963.3337 2972.1779 2973.6838 2974.6032 2978.6651 2985.4936 2988.4621 3003.6448 3026.3739 3045.0088 3047.5462 3054.7624 3058.9847 3062.9012 3063.8625 3065.6615 3066.5119 3071.5568 3072.4988 3073.9408 3085.6201 3484.4417
redmass: 3.5289 2.0268 3.9828 3.5639 2.5924 5.5636 2.3118 3.2279 2.7086 2.2955 3.3341 1.2192 2.4970 2.0948 1.3109 1.2311 1.9255 3.5265 3.0231 3.3383 2.1463 2.6099 2.2578 3.2518 2.2139 3.7502 3.6430 3.2752 2.2718 3.3173 1.2991 1.3584 1.1168 3.1232 1.2875 2.5468 2.2552 1.6083 1.7660 1.3923 1.2962 1.3847 1.4871 1.8867 2.0305 2.1988 3.5195 2.3325 2.5073 2.3143 2.5282 1.7969 1.7670 2.0973 1.4241 2.0511 1.3623 1.9215 1.4890 1.4092 1.2645 1.1634 1.2265 1.6221 1.1914 1.0832 1.5519 1.3500 1.4165 1.4367 1.4517 1.5730 1.2669 1.2320 1.2120 1.2234 2.5633 1.1059 1.0888 1.0809 1.0795 1.0516 1.0720 1.0547 1.0674 1.0421 1.0575 1.0793 1.0730 1.7359 6.4098 10.6954 1.0601 1.0779 1.0522 1.0475 1.0610 1.0644 1.0363 1.0371 1.0657 1.0665 1.0975 1.0984 1.0922 1.0981 1.0993 1.0911 1.0925 1.0975 1.0953 1.0986 1.1006 1.0989 1.0994 1.0997 1.0790
irintensity: 0.6532 0.0126 0.2500 0.0614 1.2056 7.9815 0.5590 0.8320 1.7915 0.3447 4.2390 0.6944 1.2605 0.7200 0.6987 0.2430 0.1102 2.3348 1.1915 4.4928 0.7795 2.0669 4.9514 0.3282 4.5009 1.4787 20.1006 7.7876 8.4618 22.0826 51.7133 32.9604 4.4325 7.1404 3.0899 0.8289 10.0671 26.0123 1.7873 16.7000 4.5555 13.0079 2.6978 2.1329 8.3939 1.7472 0.1823 10.4316 6.8315 1.7425 0.5140 3.3594 7.3500 2.5000 1.7804 9.5104 1.0240 5.1516 2.4552 28.3703 2.4749 2.0222 3.2878 29.1921 17.3636 1.1576 12.4625 1.6326 7.0354 5.1639 16.6744 0.4832 0.3371 24.0817 10.7364 13.5702 1.7707 34.4079 10.4385 5.1659 16.1473 6.8474 1.1097 5.0640 4.7519 11.9612 20.3051 28.6158 12.1746 121.6565 259.0015 22.3658 18.7261 23.1031 8.9864 27.8453 78.8520 29.6452 44.3515 40.1537 48.3905 17.6555 3.8891 10.0815 6.0770 23.2257 40.2964 17.4110 23.1894 10.2683 14.9106 24.6568 101.6065 76.4144 60.3227 29.7184 143.9211
temp: 298.150 k
press: 1.00000 atm
elementType: 8 7 6 6 6 6 6 6 6 6 6 6 6 6 6 6 1 1 1 1 1 1 1 1 1 1 1 1 1 1 1 1 1 1 1 1 1 1 1 1 1
symmnumber: 1
zpe: 946374.2 jmol-1
zpe.correction: 0.360455 hartree
zpe.thermalcorrener: 0.379914 hartree
zpe.thermalcorrenthalpy: 0.380858 hartree
zpe.thermalcorrgfe: 0.310311 hartree
zpe.sumelectzpe: -677.143033 hartree
zpe.sumelectthermal: -677.123574 hartree
zpe.sumelectthermalent: -677.122630 hartree
zpe.sumelectthermalfe: -677.193178 hartree
dipole: 4.5165 -0.6201 1.0605
dipole: 4.6806
quadrupole: -119.3874 -94.0028 -100.5136
quadrupole: 4.1422 -4.6992 -0.7518
quadrupole: -14.7528 10.6318 4.1210 4.1422 -4.6992 -0.7518
hfenergy: -677.5034881 hartree
pointgroup: C01 [X(C14H25N1O1)]
dipole: 1.7972089 -0.2692249 0.2977685 debye
polarizability: 199.2430835|-32.9669106|173.8266789|16.2206948|-0.0714669|129.3179864 unknown
InChI: InChI=1S/C14H25NO/c1-4-5-6-7-8-9-10-11-14(16)15-12-13(2)3/h7,9,13,15H,4-6,10-12H2,1-3H3
charge 0 multiplicity 1
41 atoms
O  -4.358343 1.118274 -0.480843
N  -2.242485 0.244579 -0.045255
C  -2.257232 -1.918341 -1.386507
C  -2.677298 -1.162199 -0.093839
C  -0.72079 -2.05328 -1.504701
C  -2.862983 -1.263638 -2.648605
C  -2.544075 2.71629 -0.123217
C  3.324624 -0.926263 1.599962
C  -3.122931 1.295175 -0.239007
C  3.567059 -2.451337 1.530753
C  2.350634 -0.429882 0.499977
C  -1.021123 2.910414 -0.346325
C  4.530635 -2.955013 2.626747
C  2.165245 1.081905 0.521342
C  -0.14271 2.389826 0.79194
C  1.006091 1.72542 0.64981
H  -2.684321 -2.939209 -1.284373
H  -3.77897 -1.151241 -0.01522
H  -2.26843 -1.691134 0.790239
H  -0.445897 -2.647224 -2.395763
H  -0.287076 -2.55402 -0.617324
H  -0.243217 -1.059674 -1.608821
H  -2.450596 -0.248311 -2.796759
H  -3.95953 -1.16544 -2.561563
H  -2.632264 -1.860185 -3.550801
H  -1.272215 0.4610 0.202021
H  -2.828225 3.104479 0.876237
H  -3.108167 3.323768 -0.853181
H  4.29406 -0.395232 1.501813
H  2.919345 -0.656883 2.595733
H  2.595527 -2.979317 1.618593
H  3.972384 -2.710587 0.531215
H  2.753038 -0.7312 -0.490577
H  1.371772 -0.932267 0.611969
H  -0.840727 4.001674 -0.433108
H  -0.706037 2.463476 -1.306869
H  4.689351 -4.046582 2.554728
H  4.1330 -2.737118 3.635797
H  5.518324 -2.463692 2.542673
H  3.088191 1.678866 0.433224
H  -0.487233 2.64312 1.808584
