program: Gaussian 09
title: 000189473
version: EM64L-G09RevD.01
frameworkgroup: C1[X(C22H32O2)]
method: RPBEPBE
basis: SDD
operation: Freq
keyword: #pfreq=noraman
keyword: PBEPBE/SDD
title: #p freq=noraman PBEPBE/SDD
converged: YES YES NO NO
title: Mulliken charges:
elementType: O O C C C C C C C C C C C C C C C C C C C C C C H H H H H H H H H H H H H H H H H H H H H H H H H H H H H H H H
charge: -0.280191 -0.465677 -0.073788 0.285412 -0.524558 0.330630 -0.417310 -0.639259 -0.101613 -0.485346 -0.470018 -0.326335 -0.811853 -0.065033 -0.201429 0.371871 -0.769804 0.142444 -0.721900 -0.730443 -0.416384 -0.397072 -0.259527 -0.217411 0.243456 0.195958 0.222471 0.221399 0.216379 0.232573 0.231484 0.203640 0.183547 0.217868 0.229194 0.191798 0.259092 0.244796 0.211250 0.253214 0.199399 0.247642 0.206080 0.234380 0.228066 0.332808 0.200755 0.209086 0.242213 0.207760 0.213991 0.233114 0.230088 0.249927 0.224587 0.226578
chargesum: 0.00000
title: Mulliken charges with hydrogens summed into heavy atoms:
elementType: O O C C C C C C C C C C C C C C C C C C C C C C
charge: -0.280191 -0.132869 0.169668 0.285412 -0.106129 0.330630 0.020469 -0.175202 0.102027 -0.083931 -0.049026 -0.067242 -0.102593 0.134366 0.046213 0.371871 -0.101277 0.142444 -0.069845 -0.075578 -0.186296 -0.147146 -0.034940 0.009167
polarizability: 3.25054407e+02 -3.17324583e+00 2.36848264e+02 -7.81274634e+00 -7.16764120e+00 1.68662761e+02
1716.lowfreq: -17.0378 -7.6854 0.0003 0.0005 0.0008 3.2363 39.2940 45.3891 51.1020
frequency: 39.1423 45.3068 51.0208 70.8159 80.9493 97.9293 115.3745 131.5688 176.6920 197.3426 201.1135 210.7996 215.6190 221.9302 230.1231 237.6252 241.3087 259.5197 269.2536 271.3216 294.5894 298.8105 305.5714 316.6299 322.7841 352.6243 364.1816 378.9658 395.3636 414.5359 427.2489 440.4854 444.9550 446.3193 489.6808 504.2240 516.1030 530.2393 540.1684 545.8720 570.6148 602.3699 650.4246 694.7584 705.1565 714.6097 744.2420 758.6837 777.0200 796.4772 813.4761 844.1699 851.8148 854.5699 873.4356 885.1866 897.8759 909.9721 916.0770 923.8311 935.1676 941.5134 951.5282 954.9391 971.0593 974.9039 999.9949 1007.2495 1023.2931 1029.2196 1043.4142 1053.3427 1056.6738 1078.0611 1093.8694 1097.5782 1100.2498 1113.4265 1126.4762 1131.4428 1149.7921 1163.9955 1169.4424 1170.2430 1176.3625 1188.3603 1197.1533 1209.2913 1220.4723 1228.5776 1245.0359 1260.3376 1264.6186 1271.5077 1283.4213 1290.8229 1298.3274 1300.8711 1306.2965 1313.4908 1320.2472 1330.5480 1337.7493 1347.0804 1352.4396 1359.8893 1370.2866 1377.6845 1383.7914 1389.4032 1390.9232 1394.6103 1438.9205 1450.2296 1452.1323 1457.6726 1461.9825 1466.4189 1470.8611 1471.7824 1473.0311 1475.2384 1478.4996 1483.2007 1483.3870 1488.6824 1492.9341 1584.8177 1615.9663 1679.0442 2939.9070 2954.5222 2955.3419 2962.7402 2969.1844 2969.4015 2972.7197 2976.1717 2980.7200 2988.7436 2993.1202 2996.9989 3017.3976 3019.7566 3024.0843 3037.9430 3058.1616 3065.1372 3072.2200 3075.9932 3078.6213 3083.9318 3086.0759 3088.9805 3089.9263 3093.3674 3100.1843 3112.5575 3132.7674 3153.1412 3167.8107 3546.9121
redmass: 3.1445 4.3798 3.3812 3.1485 4.1201 3.4530 3.6112 3.3631 4.4753 2.8436 2.3428 1.1743 1.6185 1.5641 1.2818 1.8951 2.7267 2.1061 2.2206 2.2682 1.8103 1.8927 1.4514 2.1012 2.9471 3.0689 2.4987 2.8649 2.6854 3.0213 2.4604 2.7373 2.8117 2.9606 2.7399 2.8622 3.4838 3.7633 3.4636 3.5272 3.4222 4.6819 3.6606 2.4569 3.6113 3.1648 3.0383 1.3466 2.0096 2.4394 2.8893 2.8051 2.0498 1.5178 2.9404 2.0510 2.2549 1.9170 1.1779 1.9031 1.6894 1.5511 1.7674 1.4828 2.0731 1.3077 1.1239 1.8850 2.4332 2.2580 2.3706 1.8397 2.5611 2.5412 2.3563 2.3340 2.0559 2.0167 1.9684 2.1449 1.8343 1.1086 1.5318 1.3575 1.7713 2.4350 1.7539 1.3970 2.1206 1.4569 1.4917 1.6635 1.4733 1.5566 1.4047 1.3152 1.3869 1.3086 1.3794 1.4098 1.4991 1.3821 1.4318 1.4232 1.4121 1.3286 1.4456 1.2149 7.1981 1.2392 1.3321 1.2091 2.2764 1.0778 1.1690 1.0730 1.0843 1.0531 1.0613 1.0955 1.0658 1.7104 1.1609 1.0546 1.0956 1.0828 1.0480 6.7432 6.9454 6.9355 1.0806 1.0746 1.0660 1.0744 1.0641 1.0369 1.0376 1.0625 1.0743 1.0405 1.0649 1.0362 1.0973 1.0979 1.0955 1.0969 1.0985 1.0979 1.0949 1.0925 1.0988 1.0987 1.0885 1.0991 1.0962 1.0996 1.1000 1.0881 1.0878 1.0938 1.0996 1.0656
irintensity: 0.1453 0.1735 0.3963 0.9370 0.3649 0.3135 1.1683 0.0811 2.0168 1.4269 0.9205 2.4539 0.7781 0.3053 1.5716 1.0074 3.8869 0.9630 4.1702 3.1142 4.5384 19.1602 81.9624 13.3793 4.8118 1.7737 0.2198 1.5038 5.7372 4.2121 2.9198 3.5261 8.2296 1.5278 3.3108 4.9759 3.1616 0.9429 0.9618 1.4319 1.7156 0.9454 2.3813 2.9959 3.3408 2.7120 13.0488 87.9637 4.3320 5.0739 4.8675 2.2713 21.3864 11.1629 36.8714 23.8006 1.8343 17.5345 4.3987 27.4215 15.3398 9.0782 10.6184 5.9952 2.4373 0.0623 49.0093 10.6328 17.3204 21.6151 2.6235 35.4247 11.8984 48.7479 2.9908 27.3466 24.9656 9.4631 12.4942 27.3905 11.9706 7.9464 15.4656 23.0907 14.0814 25.8355 106.1353 6.7171 48.8998 27.6482 5.2296 11.1229 1.3591 8.2485 5.8863 3.6071 6.0448 2.6175 1.7275 12.0390 17.3354 1.8147 0.8461 8.0724 0.1828 2.0528 11.9320 13.8364 20.6020 32.5293 33.4296 20.4600 41.2705 2.5287 7.6672 17.0186 2.5797 4.9378 0.7870 11.4300 3.8931 53.3432 15.6663 5.1194 20.5132 15.6668 21.7110 33.8307 17.7544 2.4189 2.2524 23.1196 16.1003 41.7176 4.5738 26.8089 48.3004 22.1676 47.9476 7.7738 21.3430 13.5121 9.3963 31.9420 50.9855 58.8652 2.0019 92.2363 16.1111 8.7958 34.0810 45.5351 32.3457 30.0889 27.6036 29.9880 14.1175 9.9986 10.5672 26.8846 22.6140 6.4057
temp: 298.150 k
press: 1.00000 atm
elementType: 8 8 6 6 6 6 6 6 6 6 6 6 6 6 6 6 6 6 6 6 6 6 6 6 1 1 1 1 1 1 1 1 1 1 1 1 1 1 1 1 1 1 1 1 1 1 1 1 1 1 1 1 1 1 1 1
symmnumber: 1
zpe: 1279494.0 jmol-1
zpe.correction: 0.487334 hartree
zpe.thermalcorrener: 0.511575 hartree
zpe.thermalcorrenthalpy: 0.512519 hartree
zpe.thermalcorrgfe: 0.436088 hartree
zpe.sumelectzpe: -1006.110797 hartree
zpe.sumelectthermal: -1006.086556 hartree
zpe.sumelectthermalent: -1006.085612 hartree
zpe.sumelectthermalfe: -1006.162043 hartree
dipole: -0.7259 0.0626 1.2451
dipole: 1.4426
quadrupole: -146.3295 -155.6765 -144.9463
quadrupole: -11.7796 0.0505 -2.2099
quadrupole: 2.6546 -6.6924 4.0378 -11.7796 0.0505 -2.2099
hfenergy: -1006.5981309 hartree
pointgroup: C01 [X(C22H32O2)]
dipole: -0.2896683 0.0362173 0.4867185 debye
polarizability: 325.0184409|-5.0447904|236.8531348|-6.4099342|-7.8254627|168.6938556 unknown
InChI: InChI=1S/C22H32O2/c1-16(2)17-9-12-21(3,23)13-11-19-15-18-7-5-6-8-20(18)24-22(19,4)14-10-17/h5-8,10,14,16-17,19,23H,9,11-13,15H2,1-4H3
charge 0 multiplicity 1
56 atoms
O  1.938893 1.241729 -0.229008
O  -2.725405 -3.6531 0.332635
C  1.003783 -1.062501 -0.14878
C  0.855649 0.407335 0.41112
C  -0.198243 -1.987105 0.20389
C  -2.774737 -2.284406 -0.278899
C  -1.36026 -1.947802 -0.832568
C  2.35932 -1.647024 0.311016
C  -2.960543 1.216726 -0.080879
C  -3.307044 -1.314852 0.823266
C  -3.900832 0.076417 0.452463
C  -0.440907 0.964272 -0.120791
C  1.023892 0.514983 1.938535
C  -3.619999 2.624127 0.133182
C  -1.597327 1.101175 0.573943
C  3.504023 -0.67411 0.059228
C  -3.779339 -2.442366 -1.430586
C  3.239432 0.69806 -0.208769
C  -2.722554 3.753968 -0.424254
C  -5.029132 2.709256 -0.504577
C  4.853388 -1.104155 0.04671
C  4.290313 1.601249 -0.497982
C  5.912334 -0.212718 -0.22818
C  5.623356 1.145618 -0.508637
H  1.041334 -0.951538 -1.252766
H  -0.568645 -1.718756 1.213824
H  0.174929 -3.027438 0.281979
H  -1.405563 -0.954913 -1.30902
H  -1.139801 -2.677159 -1.636939
H  2.551261 -2.593981 -0.229648
H  2.304129 -1.913948 1.38726
H  -2.824001 1.088402 -1.176539
H  -2.520861 -1.178514 1.593131
H  -4.1217 -1.878564 1.321255
H  -4.728113 -0.064657 -0.268309
H  -4.373294 0.45532 1.383944
H  -0.45222 1.08915 -1.213882
H  0.818805 1.548632 2.26402
H  0.339052 -0.163309 2.477597
H  2.055754 0.26379 2.235976
H  -3.726477 2.774365 1.230346
H  -1.593249 1.008479 1.67088
H  -3.838774 -1.521761 -2.037926
H  -3.467176 -3.274788 -2.084766
H  -4.785053 -2.674882 -1.038767
H  -2.121015 -3.619996 1.118502
H  -2.607491 3.655472 -1.521713
H  -3.16935 4.745086 -0.221702
H  -1.713507 3.73077 0.022579
H  -4.979098 2.492697 -1.589748
H  -5.444084 3.727409 -0.386308
H  -5.743627 2.002382 -0.047905
H  5.069887 -2.161397 0.247726
H  4.039937 2.646482 -0.705084
H  6.947451 -0.570272 -0.231862
H  6.434299 1.847959 -0.731511
