program: Gaussian 09
title: 000189472
version: EM64L-G09RevD.01
frameworkgroup: C1[X(C8H10Cl2N2O)]
method: RPBEPBE
basis: SDD
operation: Freq
keyword: #p
keyword: freq=noraman
keyword: PBEPBE/SDD
title: #p freq=noraman PBEPBE/SDD
converged: YES YES NO NO
title: Mulliken charges:
elementType: Cl Cl O N N C C C C C C C C H H H H H H H H H H
charge: -0.073308 0.006939 -0.276758 -0.444408 0.102276 0.183648 0.301471 -0.648082 -0.701251 -0.737594 0.151467 -0.223457 -0.290150 0.264897 0.330325 0.267237 0.237528 0.211932 0.217405 0.213697 0.256053 0.287846 0.362286
chargesum: 0.00000
title: Mulliken charges with hydrogens summed into heavy atoms:
elementType: Cl Cl O N N C C C C C C C C
charge: -0.073308 0.006939 -0.276758 -0.082122 0.102276 0.183648 0.301471 -0.052861 0.015447 -0.050439 0.151467 0.064389 -0.290150
polarizability: 1.75460833e+02 -1.06965029e+01 1.21096745e+02 -6.17213797e+00 -1.12559198e+00 7.35980154e+01
1716.lowfreq: -8.1028 -2.0069 -0.0815 -0.0031 -0.0027 -0.0020 45.2554 86.0009 87.3786
frequency: 45.2301 85.9925 87.3683 131.9704 159.7003 191.7467 229.9199 242.4490 253.3878 304.2018 319.4867 334.4184 344.4493 367.1726 380.7613 396.0397 466.4942 523.5676 563.2226 592.5712 626.8284 683.8163 717.7643 761.7999 781.2185 799.8776 871.1155 885.3027 906.8078 940.6765 966.8631 1013.1218 1047.0093 1096.8738 1107.5046 1158.2995 1202.2607 1214.9332 1242.1681 1258.6167 1298.6100 1333.5747 1377.1051 1398.4357 1403.2731 1445.7075 1465.9439 1476.5861 1491.3526 1500.0194 1501.7405 1557.3472 1620.1401 2982.2367 2994.0902 3052.5909 3074.2189 3091.1060 3102.7172 3112.2486 3150.7777 3187.3352 3520.5990
redmass: 7.1637 5.6043 5.7013 5.4049 4.7383 5.4592 6.0488 1.1727 3.5417 4.6075 1.0747 4.1280 3.7834 6.1781 3.5501 3.2578 3.3144 4.4733 5.6596 6.8646 8.4251 5.4647 6.3954 2.0788 2.1700 4.1754 3.7642 1.5813 1.4488 1.4507 2.0049 1.3701 2.5583 1.4517 3.7186 2.7613 3.3933 2.6433 4.0872 1.7746 1.3754 2.2409 1.2084 1.3750 1.4369 1.0841 1.0571 1.0510 1.0610 1.1743 3.3479 5.4526 5.8257 1.0376 1.0354 1.0580 1.0996 1.0997 1.0973 1.1006 1.1098 1.0922 1.0791
irintensity: 0.5430 0.6595 1.4861 5.4614 0.7061 1.9632 2.4283 0.7434 1.4455 8.2285 0.0987 0.2581 1.1535 1.2920 2.6838 0.8346 6.7279 16.9858 11.0381 0.9341 41.4207 25.5244 4.9920 17.4066 91.3299 4.5836 106.1081 4.4807 6.1821 3.3733 10.4743 14.3689 39.7495 8.0813 32.9053 18.4011 8.9954 2.8442 36.2458 17.3303 5.3113 14.9577 39.7648 7.2855 24.4322 6.4739 7.3703 12.2229 16.0638 28.6094 2.1908 191.6201 184.3964 18.1119 22.2796 12.4780 29.9269 13.3305 15.3095 6.2616 4.5696 0.3710 66.9985
temp: 298.150 k
press: 1.00000 atm
elementType: 17 17 8 7 7 6 6 6 6 6 6 6 6 1 1 1 1 1 1 1 1 1 1
symmnumber: 1
zpe: 451236.0 jmol-1
zpe.correction: 0.171867 hartree
zpe.thermalcorrener: 0.184939 hartree
zpe.thermalcorrenthalpy: 0.185883 hartree
zpe.thermalcorrgfe: 0.131868 hartree
zpe.sumelectzpe: -1414.701306 hartree
zpe.sumelectthermal: -1414.688234 hartree
zpe.sumelectthermalent: -1414.687290 hartree
zpe.sumelectthermalfe: -1414.741305 hartree
dipole: 1.5699 -1.3825 0.4667
dipole: 2.1433
quadrupole: -109.5431 -90.1596 -89.5162
quadrupole: 4.6012 -1.6422 -1.4894
quadrupole: -13.1368 6.2467 6.8901 4.6012 -1.6422 -1.4894
hfenergy: -1414.8731731 hartree
pointgroup: C01 [X(C8H10Cl2N2O1)]
dipole: -0.5702595 0.5894418 0.1959668 debye
dipolederiv: -0.7167519 -0.037802 0.0897419 -0.0862547 -0.1790244 0.0013814 0.0777308 -0.0054233 -0.2094102 -0.5217875 0.3487934 -0.0260123 0.3652506 -0.4054227 0.0172301 -0.0276179 0.0175661 -0.0533474 -0.8980755 0.3454311 -0.0179742 0.4738036 -0.9376554 0.0120097 0.0106715 0.0000361 -0.3677024 -0.4010485 0.6569079 0.0206978 -0.3143367 -0.2083016 -0.0233125 -0.0250217 0.0522137 -0.2748018 -0.4214357 -0.4846787 -0.0454615 0.4354531 -0.1418902 0.0307417 -0.0128395 -0.03755 -0.0716506 -0.1697956 0.0400024 0.0255362 0.1564059 0.1205776 0.0289581 -0.1027731 -0.0173891 0.0296914 0.4330597 0.096963 0.0687757 0.3159978 -0.3008329 -0.0097043 0.2122271 0.0005941 -0.0772569 0.8389051 0.0533116 -0.0895867 -0.0338432 0.0499354 -0.0125072 -0.1976723 -0.0340529 0.1800701 -0.128338 -0.0143892 -0.0566046 -0.1107421 -0.0493442 -0.0048548 0.0476807 0.0392164 0.0021211 -0.0555435 -0.0445358 0.0038011 -0.0440241 -0.0909987 -0.0224848 0.0122188 -0.017362 0.0406353 1.0170845 -0.6319897 0.0212312 -0.5931763 0.8548737 -0.0144205 0.0196099 -0.0146325 0.2349319 -0.239251 0.0256397 -0.0251333 0.2275176 -0.0053348 0.0297139 -0.0109629 0.009855 -0.0160862 0.8079822 -0.4559028 0.0535685 -0.9142012 0.7501541 -0.0498234 0.0218059 -0.0157241 0.0149759 -0.043619 0.0105583 -0.0575789 -0.0021199 0.0656745 0.0839774 -0.019841 0.0438806 -0.0638842 0.0616503 -0.0202241 -0.0128456 0.0510626 0.0071447 -0.0478812 -0.0516923 -0.0024877 0.1036159 0.1507311 -0.0205914 0.0174465 0.0131648 -0.0679563 0.0446244 0.0453461 -0.0135413 0.1006492 -0.0914266 -0.0483186 -0.0695959 -0.0504622 0.0952632 -0.0035919 -0.0701674 0.0050938 0.0883902 0.0386224 0.0588378 0.1189302 0.0508135 0.0574994 -0.0796791 0.0786374 -0.0354124 -0.0653299 0.0281042 0.0809149 0.1125808 0.0440487 0.0435266 -0.0434215 0.1031357 -0.0567933 -0.0522818 0.0707224 0.065657 -0.0786671 0.0248494 0.0192166 0.0628004 -0.071709 0.0903358 -0.0907288 -0.0768418 -0.0934265 -0.0445615 -0.0288964 0.1037947 0.0079744 -0.0363506 0.000288 0.1080092 0.1465996 -0.0117642 0.0016931 -0.0287471 -0.008897 -0.0077181 0.0074858 -0.0076522 0.1218169 0.170453 0.0806058 -0.0099817 0.0484363 0.2279978 -0.000012 -0.0099022 -0.0010589 0.317573 unknown
polarizability: 173.8796525|-14.5163381|122.9747755|3.3699496|0.7061073|73.3011655 unknown
InChI: InChI=1S/C8H10Cl2N2O/c1-8(2,4-9)5-3-6(10)11-12-7(5)13/h3,12H,4H2,1-2H3
charge 0 multiplicity 1
23 atoms
Cl 4.08775 0.339367 -0.860882
Cl -3.738729 1.75574 -0.179329
O  0.468248 -2.347685 0.004466
N  -1.732941 -1.633969 -0.12492
N  -2.776271 -0.742527 -0.180083
C  1.461858 0.496024 0.279893
C  -0.008849 0.074936 0.090638
C  2.241717 -0.075095 -0.941446
C  1.988169 -0.122427 1.612191
C  1.614508 2.034634 0.336987
C  -0.341111 -1.368602 -0.005284
C  -1.054709 0.987232 0.028748
C  -2.409534 0.529332 -0.106132
H  1.897527 0.371019 -1.887712
H  2.19636 -1.171531 -0.973191
H  1.910026 -1.221412 1.60226
H  3.048645 0.152583 1.745214
H  1.413774 0.272055 2.469496
H  1.064368 2.459877 1.195947
H  1.263005 2.524617 -0.590593
H  2.679948 2.287135 0.462415
H  -0.873227 2.062059 0.087432
H  -2.00843 -2.619364 -0.185516
