program: Gaussian 09
title: 000189468
version: EM64L-G09RevD.01
frameworkgroup: C1[X(C14H11NO3S)]
method: RPBEPBE
basis: SDD
operation: Freq
keyword: #p
keyword: freq=noraman
keyword: PBEPBE/SDD
title: #p freq=noraman PBEPBE/SDD
converged: NO YES NO NO
title: Mulliken charges:
elementType: S O O O N C C C C C C C C C C C C C C H H H H H H H H H H H
charge: 0.260142 -0.224448 -0.383218 -0.290410 -0.155057 0.327781 0.151767 -0.372390 -0.355647 0.674415 -0.583659 -0.496063 -0.327551 0.078218 0.112031 -0.276334 -0.662390 -0.512453 0.102721 0.234458 0.233941 0.256958 0.299821 0.286075 0.264142 0.239649 0.245044 0.229250 0.266289 0.376920
chargesum: 0.00000
title: Mulliken charges with hydrogens summed into heavy atoms:
elementType: S O O O N C C C C C C C C C C C C C C
charge: 0.260142 -0.224448 -0.006298 -0.290410 -0.155057 0.327781 0.151767 0.096009 -0.098689 0.674415 -0.283838 -0.496063 -0.041476 0.078218 0.112031 -0.012192 0.051552 -0.246164 0.102721
polarizability: 3.20072401e+02 1.60438860e+00 2.05033903e+02 8.41706509e-01 -9.52985929e+00 8.06922629e+01
1716.lowfreq: -5.4919 -2.1843 -0.0018 0.0003 0.0011 8.5269 33.2407 42.0052 75.1830
frequency: 33.2188 41.9978 75.1558 86.0852 96.8600 135.3869 150.2843 197.7356 220.9014 229.2752 260.4285 276.0769 301.0903 335.2814 349.0090 370.6137 391.4003 421.0194 466.3640 472.6497 490.7366 528.5698 549.3221 565.5323 596.2208 630.9939 640.3699 645.4725 676.9576 690.0310 731.3291 743.1247 756.6570 774.6496 784.9069 805.0778 812.9309 844.5544 852.1964 896.3622 950.9562 961.3681 965.4494 986.5332 1031.1995 1065.7651 1086.6193 1092.8545 1107.9213 1136.7423 1182.5137 1229.3951 1241.0487 1260.0358 1264.2467 1295.6697 1334.0462 1354.0415 1371.7578 1390.0691 1396.6686 1401.1984 1430.3995 1469.1294 1475.4382 1484.8208 1502.1794 1515.6630 1547.0765 1558.9342 1583.2244 1618.2595 1628.0503 2997.6842 3023.3343 3075.5170 3096.2133 3107.2210 3148.1162 3150.1564 3170.4668 3179.9101 3237.5007 3491.7265
redmass: 9.2649 10.7248 4.5100 4.8701 3.8208 7.1190 5.3359 1.2677 5.4713 2.9888 8.2584 5.0265 5.7916 5.3042 3.9141 7.7057 5.5366 3.2756 4.7635 4.0932 4.9308 9.3221 4.2120 4.6682 1.5940 4.3318 6.0148 2.9530 5.7206 2.2220 3.8783 6.1175 5.5923 2.0472 2.4985 4.7735 1.6480 4.8832 1.5928 1.3106 2.4217 1.4295 1.5191 4.3775 3.1497 3.3839 1.3624 1.6144 2.3348 1.7024 1.6900 1.8311 2.2024 1.2650 1.8623 2.7640 1.7012 1.6133 4.8653 3.5170 2.1471 1.7839 4.3196 1.1122 3.5416 1.0532 1.2033 4.5475 7.7839 9.1128 7.3487 7.6437 7.7873 1.0361 1.0620 1.1022 1.0996 1.1019 1.0918 1.0927 1.0913 1.0921 1.1005 1.0634
irintensity: 3.0504 0.4192 2.9004 0.5962 0.3166 0.2554 0.7547 1.9179 0.2791 3.4797 2.1969 2.3868 1.0924 2.6273 0.4817 12.4390 1.2691 7.7183 2.9123 4.7216 12.7458 4.6350 16.8841 47.6588 90.6130 23.7112 19.9246 8.5615 3.8368 75.5789 3.7803 7.2027 30.6022 44.3045 3.5035 14.8861 4.8640 3.0674 21.2746 1.3776 3.0938 24.0941 13.6218 76.0007 146.9507 143.5798 2.4080 70.9428 93.0413 2.7212 56.2539 34.0641 9.2507 33.8339 16.1385 6.5256 45.7107 38.9999 14.4269 5.9255 16.3865 25.3698 3.0118 59.4480 164.1577 0.7201 40.0758 4.8706 133.5904 76.9375 508.7516 147.7215 210.5959 16.3419 27.8939 1.7359 31.5238 27.4395 3.9666 3.2989 5.1466 4.0542 0.9983 35.5877
temp: 298.150 k
press: 1.00000 atm
elementType: 16 8 8 8 7 6 6 6 6 6 6 6 6 6 6 6 6 6 6 1 1 1 1 1 1 1 1 1 1 1
symmnumber: 1
zpe: 577341.4 jmol-1
zpe.correction: 0.219898 hartree
zpe.thermalcorrener: 0.236115 hartree
zpe.thermalcorrenthalpy: 0.237059 hartree
zpe.thermalcorrgfe: 0.175419 hartree
zpe.sumelectzpe: -1217.262745 hartree
zpe.sumelectthermal: -1217.246528 hartree
zpe.sumelectthermalent: -1217.245584 hartree
zpe.sumelectthermalfe: -1217.307224 hartree
dipole: 3.9347 4.9704 -0.2483
dipole: 6.3442
quadrupole: -116.7361 -107.6637 -119.8107
quadrupole: -8.0812 0.3487 -0.7851
quadrupole: -1.9993 7.0732 -5.0739 -8.0812 0.3487 -0.7851
hfenergy: -1217.4826428 hartree
pointgroup: C01 [X(C14H11N1O3S1)]
dipole: 1.4341675 2.0414528 -0.0751802 debye
polarizability: 319.3937221|8.3726103|205.5888859|5.3456951|-9.4067217|80.8159586 unknown
InChI: InChI=1S/C14H11NO3S/c1-2-15-7-10(14(17)18)13(16)9-5-8-3-4-19-12(8)6-11(9)15/h3-7,17H,2H2,1H3
charge 0 multiplicity 1
30 atoms
S  4.464749 0.899265 -0.099321
O  -1.340402 -2.590316 0.162316
O  -4.07586 -2.072252 0.010187
O  -4.721189 0.129632 -0.274603
N  -0.839865 1.546415 -0.327596
C  0.314093 0.728186 -0.190151
C  0.129196 -0.689147 -0.026503
C  -0.729388 3.02795 -0.446827
C  1.619476 1.286479 -0.219129
C  2.562882 -0.995962 0.073335
C  1.256782 -1.526761 0.102213
C  2.71548 0.422568 -0.090154
C  -2.086904 0.980332 -0.294264
C  -1.231242 -1.331373 0.011776
C  -2.348178 -0.380868 -0.136901
C  3.837369 -1.683154 0.188401
C  -0.497607 3.724064 0.91046
C  4.923706 -0.843724 0.117726
C  -3.791747 -0.719647 -0.142383
H  0.076859 3.267036 -1.162478
H  -1.669604 3.388338 -0.897373
H  1.778222 2.360675 -0.336217
H  1.06849 -2.599212 0.223056
H  -2.939589 1.658983 -0.403066
H  3.9256 -2.764283 0.318089
H  -1.337593 3.526275 1.598358
H  0.430259 3.377703 1.395651
H  -0.423097 4.816214 0.762754
H  5.98275 -1.089929 0.174248
H  -5.067747 -2.175187 -0.009104
