program: Gaussian 09
title: 000189467
version: EM64L-G09RevD.01
frameworkgroup: C1[X(C20H26O6)]
method: RPBEPBE
basis: SDD
operation: Freq
keyword: #pfreq=noraman
keyword: PBEPBE/SDD
title: #p freq=noraman PBEPBE/SDD
converged: YES YES NO NO
title: Mulliken charges:
elementType: O O O O O O C C C C C C C C C C C C C C C C C C C C H H H H H H H H H H H H H H H H H H H H H H H H H H
charge: -0.282399 -0.320444 -0.328798 -0.294740 -0.308847 -0.303951 -0.560736 -0.579328 0.393312 0.622671 0.104202 -0.612328 -0.567608 -0.400217 0.068575 0.284136 0.266408 0.010004 0.226872 -0.397077 -0.495998 -0.557604 -0.527966 -0.526293 -0.523371 -0.527798 0.254290 0.211963 0.212504 0.217282 0.256866 0.280931 0.237075 0.246817 0.224555 0.241554 0.221025 0.262833 0.257171 0.219369 0.253541 0.222272 0.224415 0.226587 0.259794 0.213951 0.226480 0.229867 0.239344 0.219621 0.254338 0.224879
chargesum: 0.00000
title: Mulliken charges with hydrogens summed into heavy atoms:
elementType: O O O O O O C C C C C C C C C C C C C C C C C C C C
charge: -0.282399 -0.320444 -0.328798 -0.294740 -0.308847 -0.303951 -0.094483 -0.149541 0.393312 0.622671 0.104202 -0.355461 -0.286677 -0.163143 0.068575 0.284136 0.266408 0.010004 0.226872 -0.150260 0.191136 0.181769 0.172262 0.174039 0.172321 0.171039
polarizability: 2.80274997e+02 5.37780215e+00 2.58323106e+02 3.82617900e+01 -8.98487911e+00 1.80735627e+02
1716.lowfreq: -40.1017 -4.4585 0.0003 0.0007 0.0008 5.0948 6.4363 20.6578 23.4466
frequency: -40.0867 20.0289 23.3444 36.1016 50.5343 59.4003 71.4922 80.3263 86.1293 92.2645 98.8815 104.9055 128.8710 142.0408 157.1059 161.5274 164.9694 167.4325 175.3620 177.6106 187.2569 205.7127 217.3009 228.9850 233.7422 257.5265 275.7277 283.7842 302.0554 322.3125 326.9473 329.1009 363.5136 368.7933 392.2444 398.8837 440.8640 471.6672 475.8333 484.1349 485.7097 535.4859 549.5859 580.2300 593.1986 610.0588 638.9735 647.4795 673.4057 706.2519 711.6197 756.6707 764.5257 818.3662 840.2744 863.2883 864.6423 867.3990 881.0420 892.5353 922.6987 933.3265 937.8750 946.3795 958.9144 979.4177 1007.2937 1016.2632 1033.9935 1047.9718 1107.6582 1109.4235 1111.7758 1112.2103 1112.3552 1113.6200 1120.9530 1131.8784 1150.1501 1151.1905 1151.8980 1154.5169 1156.0202 1159.2708 1164.0951 1180.3342 1185.0174 1204.5514 1214.8292 1231.4055 1271.9896 1292.4902 1304.2529 1333.9052 1359.1557 1365.0285 1398.1857 1399.8780 1416.9378 1417.3325 1434.7947 1438.1011 1439.3118 1441.8265 1450.7543 1455.3378 1457.0402 1457.2450 1458.4827 1460.8595 1463.8017 1464.9445 1466.1240 1468.4358 1471.4217 1475.5166 1482.1440 1483.4248 1486.7615 1493.4319 1569.6426 1580.8192 1592.1545 1607.7219 2967.1995 2968.1965 2970.3033 2971.5931 2973.0189 2980.9795 2988.5440 2998.1562 3039.4822 3063.5806 3068.3096 3071.0875 3072.2130 3076.5224 3081.9823 3093.0412 3112.6748 3114.5321 3116.9150 3117.1576 3118.1705 3122.4583 3123.4843 3148.7229 3155.7172 3169.2026
redmass: 2.9665 4.6962 4.7958 3.7756 3.5680 4.2839 4.2898 3.3932 2.9687 3.1910 3.0196 4.0147 2.8587 2.2753 1.1211 1.2783 1.1556 1.4216 2.3216 1.1083 2.8514 2.6152 1.7564 2.1851 3.1497 4.2798 3.3638 4.5472 4.4385 3.3374 4.3914 3.8891 4.8604 5.4060 5.1420 4.5249 5.4745 4.6102 4.9901 5.2342 4.0462 4.8976 3.9500 4.8173 4.9433 5.7503 4.3147 4.4490 2.9631 5.2051 4.4124 5.4729 4.0251 1.4772 4.0677 4.1253 4.8898 3.3408 2.3214 1.5026 2.7820 2.0659 2.4805 6.4189 8.7680 2.6981 3.8739 3.9923 5.1791 3.7956 1.4557 2.0406 1.2404 1.2410 1.2452 1.2417 1.2404 1.4475 1.3049 1.3417 1.3889 1.3073 1.4102 1.4576 1.3790 2.1086 2.4053 1.5351 1.5331 1.8833 3.6395 2.0164 1.9649 1.7652 6.5749 6.1716 1.9492 2.3982 1.2460 1.2586 1.2320 1.1783 1.5416 1.5239 1.0647 1.2994 1.0682 1.0573 1.0711 1.3131 1.2769 1.5368 1.1396 1.2312 1.3415 1.0605 1.0581 1.0574 1.0578 1.0545 7.4380 7.2074 7.4627 7.1104 1.0299 1.0306 1.0311 1.0329 1.0313 1.0598 1.0296 1.0646 1.1025 1.1053 1.1031 1.1038 1.1034 1.0995 1.0978 1.1021 1.1035 1.1022 1.1031 1.1054 1.1032 1.1040 1.0893 1.0915 1.0925 1.0951
irintensity: 5.1572 0.1590 0.1710 1.2965 4.8945 2.2855 1.4596 3.4462 0.6831 7.2788 1.7872 3.7339 5.4258 3.8448 0.0763 2.3826 0.5207 1.4425 1.6914 1.1497 2.2440 6.6279 1.8154 8.6732 3.1127 2.2008 2.6630 24.6282 1.8970 2.2371 1.7271 1.9490 1.1085 3.7655 2.6704 1.6829 3.1204 0.7764 1.2643 1.9021 6.2137 0.1734 7.0084 4.1994 4.4747 6.5556 9.5492 4.1419 21.6980 1.5061 11.8147 1.1902 6.7298 38.2573 9.1075 10.3454 18.7807 4.7296 44.1790 1.6790 13.9460 22.3402 38.1541 33.3981 73.8725 36.5114 40.1411 24.1784 231.7624 88.0990 7.6158 16.1744 10.3336 1.8425 5.9078 3.3163 4.2657 5.0042 4.2503 0.6789 1.2150 0.6357 5.6153 24.7294 7.4546 27.8686 27.4897 30.2319 13.7570 46.3289 65.3388 74.5002 41.1902 13.8710 12.4598 18.0854 44.7702 78.4937 5.3021 11.5518 17.0657 3.0093 22.4755 51.0582 25.4354 31.2962 2.3747 28.3559 16.3334 36.8283 16.8706 10.5919 21.2943 12.2299 44.4709 2.8749 5.8339 20.0219 23.0272 16.9728 69.2028 12.1818 27.6698 51.7749 60.7793 42.0804 93.0706 64.6467 94.7005 27.9055 62.9366 61.4122 30.1536 27.3588 21.8222 21.2780 22.1402 29.7478 11.7725 44.0152 20.7193 33.6241 32.6290 9.7844 25.5359 19.3584 13.5190 5.7247 2.0785 7.8990
temp: 298.150 k
press: 1.00000 atm
elementType: 8 8 8 8 8 8 6 6 6 6 6 6 6 6 6 6 6 6 6 6 6 6 6 6 6 6 1 1 1 1 1 1 1 1 1 1 1 1 1 1 1 1 1 1 1 1 1 1 1 1 1 1
symmnumber: 1
zpe: 1103526.6 jmol-1
zpe.correction: 0.420311 hartree
zpe.thermalcorrener: 0.448350 hartree
zpe.thermalcorrenthalpy: 0.449294 hartree
zpe.thermalcorrgfe: 0.361109 hartree
zpe.sumelectzpe: -1226.979306 hartree
zpe.sumelectthermal: -1226.951268 hartree
zpe.sumelectthermalent: -1226.950324 hartree
zpe.sumelectthermalfe: -1227.038509 hartree
dipole: 1.2318 -2.2029 -0.2780
dipole: 2.5391
quadrupole: -145.0322 -138.6888 -151.7984
quadrupole: -3.4447 -3.9100 -6.1933
quadrupole: 0.1409 6.4844 -6.6253 -3.4447 -3.9100 -6.1933
hfenergy: -1227.3996174 hartree
pointgroup: C01[X(C20H26O6)]
dipole: 0.5202683 -0.8488532 0.0818395 debye
polarizability: 269.5747734|14.3140605|254.9756497|47.3935262|-16.9076949|194.783307 unknown
InChI: InChI=1S/C20H26O6/c1-21-15-10-9-14(18(24-4)20(15)26-6)8-7-13-11-16(22-2)19(25-5)17(12-13)23-3/h9-12H,7-8H2,1-6H3
charge 0 multiplicity 1
52 atoms
O  -1.067016 1.051452 1.651991
O  -2.717319 -1.399809 1.239409
O  1.224561 -1.96389 -0.906019
O  4.170371 1.26237 1.424932
O  3.535329 -1.484805 0.743428
O  -4.569078 -1.382507 -0.933406
C  -1.003283 3.102926 -0.224612
C  0.263474 2.914348 -1.135729
C  -1.987255 1.949764 -0.340786
C  1.159945 1.76281 -0.707386
C  -1.955342 0.862973 0.588645
C  2.301134 2.001346 0.094096
C  0.858118 0.428567 -1.081896
C  -2.89541 1.897112 -1.421176
C  -2.791811 -0.272717 0.378595
C  1.643919 -0.640455 -0.608612
C  3.106994 0.936686 0.558774
C  2.766724 -0.404842 0.231918
C  -3.720348 -0.271181 -0.703232
C  -3.773329 0.807447 -1.605291
C  -0.713033 -0.014235 2.601246
C  -2.14184 -2.603898 0.581372
C  2.178755 -2.754711 -1.717134
C  5.507342 0.747641 1.055266
C  2.8634 -2.199135 1.853742
C  -5.550786 -1.647453 0.143539
H  -0.675168 3.224232 0.820765
H  -1.500199 4.041545 -0.537952
H  0.837947 3.860328 -1.116581
H  -0.080704 2.762469 -2.177059
H  2.580737 3.018497 0.388547
H  -0.000434 0.200711 -1.721273
H  -2.917536 2.735233 -2.128219
H  -4.493592 0.773039 -2.427597
H  -0.236334 -0.865682 2.083894
H  -1.594879 -0.369219 3.157747
H  0.012702 0.466514 3.276889
H  -1.120541 -2.392961 0.210182
H  -2.787172 -2.924057 -0.256108
H  -2.11631 -3.378325 1.364346
H  3.151749 -2.84005 -1.201817
H  2.313737 -2.282747 -2.708902
H  1.714388 -3.745999 -1.835274
H  6.177396 1.084443 1.861239
H  5.500533 -0.352985 0.9871
H  5.830735 1.186952 0.091531
H  3.557763 -2.997397 2.158795
H  2.685118 -1.508929 2.699644
H  1.908344 -2.635247 1.506234
H  -6.242287 -0.789258 0.246031
H  -5.039112 -1.836909 1.103867
H  -6.107495 -2.539901 -0.181804
