program: Gaussian 09
title: 000189465
version: EM64L-G09RevD.01
frameworkgroup: C1[X(C15H12BrFO4)]
method: RPBEPBE
basis: SDD
operation: Freq
keyword: #p
keyword: freq=noraman
keyword: PBEPBE/SDD
title: #p freq=noraman PBEPBE/SDD
converged: YES YES NO NO
title: Mulliken charges:
elementType: Br F O O O O C C C C C C C C C C C C C C C H H H H H H H H H H H H
charge: 0.019142 -0.178256 -0.265342 -0.279390 -0.421652 -0.192796 -0.066999 0.379373 0.322246 -0.319594 -0.361452 -0.376224 -0.352682 -0.709838 0.188144 0.163125 0.209440 -0.298401 -0.284430 -0.182548 -0.203451 0.245657 0.258288 0.258722 0.266026 0.263982 0.249162 0.226264 0.246119 0.280189 0.279889 0.253081 0.384206
chargesum: 0.00000
title: Mulliken charges with hydrogens summed into heavy atoms:
elementType: Br F O O O O C C C C C C C C C C C C C C C
charge: 0.019142 -0.178256 -0.265342 -0.279390 -0.037446 -0.192796 0.178658 0.379373 0.322246 -0.061306 -0.102730 -0.110198 -0.088700 0.011707 0.188144 0.163125 0.209440 -0.018212 -0.004541 0.070533 -0.203451
polarizability: 2.99517449e+02 1.72530169e+01 1.77290416e+02 -1.01891458e+01 -5.10341882e+00 1.21253562e+02
1716.lowfreq: -6.6394 -3.6981 -2.2396 -0.0006 -0.0005 -0.0004 10.1262 19.6612 24.7485
frequency: 8.0967 19.6062 24.7415 28.8449 54.1751 65.2649 91.6771 117.6601 144.3968 168.6661 195.4730 199.8369 213.1567 223.7972 251.7223 273.9876 286.0343 315.6088 331.6191 370.7147 390.1283 418.8489 444.1204 470.6061 485.5516 499.4950 524.0468 563.6302 586.0479 605.5332 611.7704 619.1119 640.7226 688.3405 700.2146 708.7676 732.7953 763.2725 781.8840 804.8760 816.6201 821.5263 837.8541 854.7573 865.3641 924.4767 935.5340 946.4264 959.1712 998.6567 1018.3018 1034.0772 1061.1910 1087.2595 1103.8150 1109.7708 1134.1805 1158.2772 1177.8200 1180.4516 1213.9579 1237.8755 1239.9763 1254.9703 1293.8544 1311.9709 1340.2918 1361.9626 1377.1610 1390.0021 1396.4567 1419.5089 1462.0029 1470.0681 1474.9003 1485.3962 1579.5177 1591.7468 1602.1476 1616.8086 1683.0878 3005.1363 3013.6137 3109.8758 3117.7735 3146.6818 3160.8147 3162.2986 3165.8391 3180.3425 3182.0134 3186.3914 3510.3946
redmass: 5.9000 8.6208 10.1878 6.9000 8.4734 4.1092 5.8309 6.5358 6.2609 7.2516 8.6304 6.6166 1.2752 2.6971 7.0513 5.2291 6.5772 6.1004 6.6464 6.3010 5.8144 3.0587 3.2378 5.0606 5.6618 4.6056 3.6517 5.0675 3.7985 5.3084 2.0988 2.9885 5.8790 4.4189 4.1123 4.2000 4.6629 3.6503 3.5466 1.3655 1.3266 5.6044 1.6441 1.4352 7.3652 2.9932 1.3415 1.3232 1.3400 2.7514 2.6740 2.3702 1.9535 2.0023 2.7507 1.3288 2.1628 1.7203 2.0411 1.5034 3.5313 1.5688 1.6734 2.7325 1.3034 1.3039 1.5705 6.7988 6.8987 1.2254 4.3750 3.7595 1.0463 2.9445 1.0538 2.4875 8.1150 7.6207 8.2607 6.5941 8.9638 1.0347 1.0849 1.1003 1.1016 1.0879 1.0886 1.0886 1.0964 1.0965 1.0977 1.0936 1.0642
irintensity: 1.4668 0.1909 1.7270 0.2839 0.4006 0.2971 0.9522 0.4037 0.9780 0.2698 1.2473 0.8053 0.3471 0.7657 1.8454 3.3866 1.8499 2.0946 1.0042 2.9499 3.6500 0.6234 9.3984 7.7964 13.4815 12.3303 21.5241 12.2922 16.9281 12.9342 59.1707 74.7396 2.9815 18.7548 1.3232 43.1292 6.9704 12.4226 15.7037 38.3532 11.5140 51.7398 81.4242 29.1941 17.0816 41.5069 0.4885 0.6000 0.3145 32.9696 302.7849 29.9466 3.4028 47.2685 138.2560 16.4736 0.5125 23.9651 312.2597 152.8126 122.8287 19.3121 11.2966 157.7459 2.9863 0.8113 15.3306 5.8868 10.2588 27.5403 14.7514 3.0571 16.6778 417.6066 12.3161 265.6884 27.8129 1.2290 5.3699 12.0528 177.6553 13.3107 16.2055 14.7875 13.1621 14.2278 2.1821 4.5645 3.0028 0.8892 1.7261 0.5153 26.5997
temp: 298.150 k
press: 1.00000 atm
elementType: 35 9 8 8 8 8 6 6 6 6 6 6 6 6 6 6 6 6 6 6 6 1 1 1 1 1 1 1 1 1 1 1 1
symmnumber: 1
zpe: 617244.5 jmol-1
zpe.correction: 0.235096 hartree
zpe.thermalcorrener: 0.254968 hartree
zpe.thermalcorrenthalpy: 0.255912 hartree
zpe.thermalcorrgfe: 0.181426 hartree
zpe.sumelectzpe: -991.461480 hartree
zpe.sumelectthermal: -991.441608 hartree
zpe.sumelectthermalent: -991.440664 hartree
zpe.sumelectthermalfe: -991.515149 hartree
dipole: 3.7320 -2.5172 1.3730
dipole: 4.7063
quadrupole: -119.0103 -129.3870 -132.8917
quadrupole: -2.6069 9.2717 -8.5379
quadrupole: 8.0860 -2.2906 -5.7954 -2.6069 9.2717 -8.5379
hfenergy: -991.6965755 hartree
pointgroup: C01 [X(C15H12Br1F1O4)]
dipole: 1.5216419 -0.9599295 0.4376605 debye
polarizability: 291.4396651|29.2133553|179.5461567|22.5546002|18.0791336|127.0756051 unknown
InChI: InChI=1S/C15H12BrFO4/c1-9(15(18)19)20-11-3-5-12(6-4-11)21-14-7-2-10(16)8-13(14)17/h2-9,18H,1H3
charge 0 multiplicity 1
33 atoms
Br -6.22929 -2.422797 -1.701878
F  -4.439695 1.669947 1.196154
O  3.73718 0.710272 0.376406
O  -1.853376 1.427016 0.365647
O  4.036342 -2.850047 0.913256
O  4.078741 -1.77379 -1.152903
C  4.38504 -0.469723 0.954742
C  2.328534 0.776689 0.394234
C  -0.456038 1.139616 0.332657
C  1.478846 -0.216745 0.941589
C  1.781585 1.953393 -0.172009
C  0.078802 -0.027926 0.912999
C  0.387137 2.135378 -0.205827
C  5.887241 -0.152523 0.996736
C  -2.773927 0.483523 -0.112797
C  4.138372 -1.717379 0.088072
C  -4.11988 0.641475 0.301117
C  -2.472096 -0.557032 -1.021792
C  -5.147476 -0.198238 -0.153517
C  -3.487882 -1.418703 -1.493827
C  -4.813835 -1.231292 -1.054193
H  3.999238 -0.665357 1.973377
H  1.87715 -1.129436 1.395229
H  2.461387 2.705351 -0.582309
H  -0.584202 -0.780975 1.350889
H  -0.056237 3.037992 -0.635424
H  6.258923 0.053587 -0.020617
H  6.448614 -1.000916 1.424506
H  6.054656 0.738329 1.624049
H  -1.443772 -0.690273 -1.369544
H  -6.169618 -0.037229 0.197545
H  -3.242289 -2.216715 -2.199203
H  3.949428 -3.668672 0.352435
