program: Gaussian 09
title: 000189459
version: EM64L-G09RevD.01
frameworkgroup: C1[X(C12H4Cl6O)]
method: RPBEPBE
basis: SDD
operation: Freq
keyword: #p
keyword: freq=noraman
keyword: PBEPBE/SDD
title: #p freq=noraman PBEPBE/SDD
converged: NO YES NO NO
title: Mulliken charges:
elementType: Cl Cl Cl Cl Cl Cl O C C C C C C C C C C C C H H H H
charge: 0.064649 0.064657 0.021500 0.021502 -0.001173 -0.040657 -0.263534 0.619566 0.511667 -0.292478 -0.292522 -0.080300 -0.080319 -0.300543 -0.281695 -0.251478 -0.187293 -0.219614 -0.111238 0.290660 0.263221 0.283611 0.261812
chargesum: 0.00000
title: Mulliken charges with hydrogens summed into heavy atoms:
elementType: Cl Cl Cl Cl Cl Cl O C C C C C C C C C C C C
charge: 0.064649 0.064657 0.021500 0.021502 -0.001173 -0.040657 -0.263534 0.619566 0.511667 -0.292478 -0.292522 -0.080300 -0.080319 -0.300543 -0.018475 0.039182 0.096318 0.042198 -0.111238
polarizability: 2.51114245e+02 2.17041704e-02 1.82491197e+02 8.43142962e+00 -8.97498453e-03 1.48811798e+02
1716.lowfreq: -3.4241 -0.0010 0.0007 0.0014 6.1260 6.7301 11.4990 20.3564 35.9316
frequency: 11.4716 20.3561 35.9293 67.6785 85.2432 90.9979 126.0775 146.9265 164.1382 180.2734 189.4613 195.0922 220.8729 261.5471 276.8795 304.3775 321.7193 329.5665 338.7736 361.1342 387.1527 411.3447 435.4534 496.9437 536.8403 539.6457 545.4428 586.4058 631.2585 633.2491 652.9532 688.5059 690.5366 747.4383 799.1740 805.4274 817.0630 855.8381 861.9860 921.5014 936.2174 1027.5717 1062.7535 1083.3769 1146.0552 1161.2701 1188.5213 1226.3456 1249.1294 1343.2024 1349.8613 1367.9231 1385.7505 1390.7789 1455.2215 1548.8400 1550.1335 1579.1579 1595.0759 3155.1543 3180.6777 3182.8919 3186.6730
redmass: 23.7872 12.9828 17.3096 33.6385 18.7149 8.3946 27.2256 11.3324 6.0268 32.3330 18.4933 31.5803 14.7102 11.7729 8.3135 18.5502 12.6336 29.5990 10.7879 8.3953 12.4921 10.5749 3.1671 7.5410 6.4695 6.9904 4.5096 12.0632 8.1630 6.5814 13.8006 8.1055 4.1219 9.2376 8.3224 1.4469 9.1456 1.4203 1.4005 10.3712 1.3437 4.3931 10.5853 2.4462 1.2940 1.5038 5.4064 5.6232 1.3504 11.9944 10.2697 4.7604 6.5739 3.4088 2.6201 11.0023 8.6243 7.7163 8.3133 1.0890 1.0953 1.0945 1.0932
irintensity: 0.0203 0.0598 0.0207 0.0032 0.0684 0.5956 0.0577 0.0311 0.0781 0.1729 0.7603 0.0712 0.1367 0.8095 1.3045 0.0967 0.0298 0.0511 0.2915 4.2894 3.5707 10.1135 5.2272 2.8717 0.7036 6.5109 6.9954 0.0457 4.9027 18.6628 75.2456 32.9802 0.8053 12.0952 21.3283 39.6524 0.1906 20.2154 19.5378 118.3987 0.0002 130.8962 4.8381 65.1274 0.0014 33.7722 60.3840 105.0692 24.6548 0.0004 209.7209 90.8297 3.7694 128.9550 274.7893 36.7824 18.1559 29.4952 0.3478 3.7329 0.1222 1.1854 3.5761
temp: 298.150 k
press: 1.00000 atm
elementType: 17 17 17 17 17 17 8 6 6 6 6 6 6 6 6 6 6 6 6 1 1 1 1
symmnumber: 1
zpe: 323740.9 jmol-1
zpe.correction: 0.123306 hartree
zpe.thermalcorrener: 0.141508 hartree
zpe.thermalcorrenthalpy: 0.142452 hartree
zpe.thermalcorrgfe: 0.072822 hartree
zpe.sumelectzpe: -3293.893376 hartree
zpe.sumelectthermal: -3293.875174 hartree
zpe.sumelectthermalent: -3293.874230 hartree
zpe.sumelectthermalfe: -3293.943860 hartree
dipole: -1.7946 0.0014 -1.8972
dipole: 2.6115
quadrupole: -147.3495 -154.5434 -149.8428
quadrupole: -0.0054 3.8270 0.0001
quadrupole: 3.2291 -3.9649 0.7358 -0.0054 3.8270 0.0001
hfenergy: -3294.0166821 hartree
pointgroup: C01 [X(C12H4Cl6O1)]
dipole: 0.7147197 0.0037294 0.7381194 debye
dipolederiv: -0.1515291 0.2682364 -0.0682166 0.2364338 -0.4728278 0.1044611 -0.0597736 0.104807 -0.0083742 -0.1509753 -0.2685768 -0.0656289 -0.2366311 -0.4752438 -0.1002348 -0.0574645 -0.1005158 -0.0064594 -0.2811542 0.2954501 -0.0660344 0.3415309 -0.5253815 0.0883946 -0.1008959 0.1150085 -0.0365227 -0.2805396 -0.2957385 -0.0632284 -0.3422229 -0.5277953 -0.0839437 -0.0976051 -0.1105681 -0.0346793 -0.0863332 -0.0001693 -0.0360889 -0.0000246 -0.0212019 -0.0032021 -0.0026198 -0.0032406 -0.7094549 -0.7089481 0.0015058 0.3122981 0.0016752 -0.0547694 -0.0012158 0.3397831 -0.0011934 -0.3041323 -2.2168821 0.0005578 0.1734098 0.0010715 -0.2310753 -0.0003381 0.1526283 -0.0003219 -0.2875007 1.3468285 0.0004526 0.0286831 0.0028497 -0.0121024 0.0005581 0.535988 0.0006294 0.108395 1.5880011 -0.0013771 -0.3329862 -0.004595 0.1313045 -0.0008019 -0.8717505 -0.0009422 -0.0412965 -0.0541246 -0.4541784 0.1031681 -0.5514061 0.5268057 -0.2199467 0.0249331 -0.1692029 -0.0266035 -0.0551151 0.4547057 0.0987456 0.5510704 0.5314432 0.2149074 0.0198733 0.1641126 -0.0301654 0.4022508 -0.4543343 0.124916 -0.6231672 0.7087764 -0.1962781 0.1641445 -0.1742625 0.0128416 0.4012907 0.4550458 0.1205363 0.6242872 0.7131715 0.1899586 0.1581502 0.1679582 0.0094729 -0.104485 0.0004811 0.1135321 0.0003494 -0.0906169 0.0056101 0.089509 0.0056477 1.1092169 -0.2008903 -0.0004158 -0.0787968 0.0012164 -0.1279856 0.0005641 0.255704 0.0006109 -0.0084272 -0.2106005 0.0000036 -0.0237472 -0.0001482 -0.3918018 0.0015065 -0.057649 0.0015017 -0.0640596 -0.1993039 0.0005271 0.1117604 0.0005244 -0.0465502 -0.0011781 0.1042726 -0.0011925 -0.2971213 -0.1803778 0.0008049 0.1709726 0.0002993 -0.0906806 0.0002464 0.0635469 0.000254 -0.0352214 0.9722418 -0.0024573 -0.5013902 -0.0025136 -0.0820879 0.0022048 -0.5071802 0.0021881 0.3711835 0.0627237 -0.0001943 -0.0408756 -0.0001814 0.0811803 0.0003144 -0.0377305 0.0003027 0.1545002 -0.0144743 -0.000183 -0.0479802 -0.0003785 0.1326695 -0.0003505 -0.1008735 -0.0003605 0.0616248 0.0387108 -0.0001655 -0.036495 -0.0001171 0.1636596 -0.0003745 -0.0301818 -0.000367 0.0846866 0.0836856 0.0000193 0.0034462 0.0000775 0.1611097 -0.0008619 0.0151913 -0.0008533 -0.0219031 unknown
polarizability: 251.2972042|0.0098032|182.490657|7.2345492|-0.1354813|148.6293787 unknown
InChI: InChI=1S/C12H4Cl6O/c13-5-1-2-9(6(14)3-5)19-12-10(17)7(15)4-8(16)11(12)18/h1-4H
charge 0 multiplicity 1
23 atoms
Cl 0.860693 2.761218 -0.606131
Cl 0.863466 -2.767124 -0.580698
Cl 3.934935 -2.751713 0.581266
Cl 3.93212 2.759633 0.55596
Cl -2.61104 -0.013722 -2.841445
Cl -5.353173 0.009278 1.988518
O  -0.186456 -0.006062 -1.13182
C  1.070107 -0.002473 -0.509384
C  -1.360391 -0.002133 -0.340492
C  1.729887 1.228394 -0.263381
C  1.731166 -1.230353 -0.25216
C  3.051737 -1.214444 0.246442
C  3.050471 1.21845 0.23533
C  -2.592711 -0.005285 -1.03449
C  -1.35169 0.00448 1.070948
C  3.714718 0.00349 0.491092
C  -3.812344 -0.001876 -0.332855
C  -2.56689 0.00801 1.788857
C  -3.77976 0.004787 1.075762
H  4.737635 0.005774 0.874332
H  -0.401581 0.006882 1.613862
H  -4.759852 -0.00436 -0.877293
H  -2.562941 0.013151 2.881781
