program: Gaussian 09
title: 000189368
version: EM64L-G09RevD.01
frameworkgroup: C1[X(C17H22ClN5)]
method: RPBEPBE
basis: SDD
operation: Freq
keyword: #p
keyword: freq=noraman
keyword: PBEPBE/SDD
title: #p freq=noraman PBEPBE/SDD
converged: YES YES NO NO
title: Mulliken charges:
elementType: Cl N N N N N C C C C C C C C C C C C C C C C C H H H H H H H H H H H H H H H H H H H H H H
charge: -0.028860 -0.346169 -0.396029 -0.113126 -0.003819 -0.018527 -0.069790 -0.507422 -0.440636 -0.447360 -0.429420 0.164751 0.105796 0.505282 -0.738528 -0.748658 0.070936 -0.404927 -0.390516 -0.303351 -0.244850 -0.244038 -0.247603 0.273170 0.234049 0.219999 0.208867 0.250154 0.215836 0.225226 0.217514 0.226346 0.327292 0.332367 0.222746 0.204298 0.268232 0.240553 0.219648 0.234356 0.230106 0.249279 0.222367 0.226276 0.228185
chargesum: 0.00000
title: Mulliken charges with hydrogens summed into heavy atoms:
elementType: Cl N N N N N C C C C C C C C C C C C C C C C C
charge: -0.028860 -0.018877 -0.063662 -0.113126 -0.003819 -0.018527 0.203379 -0.053374 0.018385 -0.006298 0.014440 0.164751 0.105796 0.505282 -0.043251 -0.054102 0.070936 -0.174820 -0.141237 -0.303351 -0.022484 -0.017762 -0.019419
polarizability: 2.39743176e+02 -8.22324609e-01 2.58002272e+02 -1.25299394e+01 8.93731543e+00 1.85240163e+02
1716.lowfreq: -8.3327 -6.8763 -0.0026 -0.0025 -0.0010 4.2848 14.5612 17.7395 27.3946
frequency: 12.9090 16.1433 27.2947 30.6242 43.3362 55.5977 68.8181 108.4042 122.9479 133.9916 154.4023 171.6180 187.4201 212.9743 217.3594 245.2885 264.7044 278.3183 295.9879 313.0992 320.7675 349.7413 395.2107 402.3631 406.9075 409.2089 476.0207 524.9216 544.9423 561.2259 573.5190 576.1437 601.8836 617.4734 637.1713 644.7696 674.4675 702.8832 703.8513 710.3861 727.8046 771.8440 788.0830 797.3353 801.3025 851.3079 852.3817 874.7003 880.7920 886.1648 899.4836 909.4870 922.4009 929.6895 935.5640 964.9988 977.6358 990.4645 994.3293 1008.1807 1012.1683 1021.0986 1027.0862 1051.2432 1066.3563 1083.5378 1086.8161 1106.5159 1148.0826 1155.6253 1172.5550 1185.0547 1192.2213 1194.5040 1206.2431 1216.6773 1221.6480 1239.7352 1254.8956 1259.1160 1286.2520 1292.8521 1310.5059 1318.2746 1318.9669 1328.9084 1353.1595 1373.8618 1379.4020 1391.3098 1407.9403 1434.9100 1458.8560 1461.8149 1464.7857 1466.5811 1471.4669 1476.1821 1479.7438 1482.0075 1491.9570 1493.7272 1509.5339 1540.2982 1586.2194 1592.6368 1613.4904 2979.3873 2993.1703 2994.5214 3003.8101 3006.9241 3016.2742 3046.8624 3062.8116 3066.6853 3074.5358 3077.9180 3086.1657 3090.9582 3102.8882 3114.6727 3120.5363 3127.2712 3140.7734 3151.9512 3164.4982 3542.2523 3551.4588
redmass: 4.1901 3.2731 4.0279 6.4185 1.8935 4.2717 3.3915 4.4327 4.2291 5.0197 6.2342 5.7592 6.0318 1.8323 4.9382 1.9700 2.0489 1.1536 3.4043 3.0153 2.8530 3.8757 4.8814 2.8288 4.0414 4.7906 3.2794 3.7097 3.6037 1.2516 1.5216 1.8448 3.9810 6.3924 3.7400 7.1229 2.9888 1.8987 5.0219 3.9265 3.8368 1.9242 8.4114 1.8223 1.8457 2.0249 1.9256 3.9202 2.9047 3.8175 2.0409 2.4813 1.8313 1.4842 2.2128 2.0963 1.3857 5.7367 1.3316 1.7922 1.6792 1.6323 2.3929 2.4155 2.3798 1.6413 1.4887 2.0656 2.1916 2.0714 1.0521 1.5731 2.1522 1.2388 1.4144 1.8390 3.2255 2.9234 3.4011 1.6558 1.2397 1.2924 1.4923 1.6120 1.3524 2.1269 1.6218 1.2323 6.7290 1.2485 1.6886 2.2239 1.9482 1.2342 1.1280 1.1556 1.0875 1.1014 1.1265 1.5836 1.2230 1.1156 2.0036 7.8816 7.3994 6.1462 6.0628 1.0364 1.0616 1.0357 1.0644 1.0608 1.0665 1.0997 1.0884 1.1031 1.1004 1.1010 1.0995 1.1025 1.0985 1.1005 1.0844 1.0875 1.0927 1.0948 1.1007 1.0767 1.0767
irintensity: 0.1748 0.2272 0.3239 0.0892 0.0240 0.4968 0.9538 0.3515 0.9463 1.2885 0.0256 0.3278 1.3919 0.1322 2.7856 0.1634 0.3129 0.0489 0.3171 2.7368 3.5078 0.8642 7.2417 0.1368 1.9837 1.6410 7.7170 7.8406 15.6194 43.5747 26.2514 91.5226 9.7343 0.1428 1.0426 11.3089 11.0976 45.6912 9.4191 15.2026 11.4615 38.5980 26.2668 6.9711 7.6300 11.2587 13.6083 1.0363 1.4019 15.0851 12.5407 23.2110 13.7338 9.5519 5.0754 26.1290 0.4730 0.4329 0.8017 8.5658 6.4951 5.2934 14.5984 1.0109 1.7154 19.6543 3.2276 10.4113 8.1591 3.8951 0.0836 25.6963 164.8502 13.0102 1.8521 17.0069 48.4193 15.9716 54.5777 17.4769 14.2691 4.7830 46.1020 38.3015 0.1641 228.0555 145.4260 21.3854 5.8951 62.6772 9.5658 13.2182 70.5320 49.5701 2.4002 35.4286 25.2400 14.5852 36.7762 13.8596 26.0201 51.8799 180.8582 1648.4646 199.9734 5.7696 8.7763 24.7846 18.8235 29.1632 30.9751 53.3544 23.3384 14.4818 11.8289 3.0848 27.2803 46.0014 35.8426 84.9120 24.8267 11.8476 2.3947 1.3742 22.3139 37.3496 16.9576 66.0836 40.2661
temp: 298.150 k
press: 1.00000 atm
elementType: 17 7 7 7 7 7 6 6 6 6 6 6 6 6 6 6 6 6 6 6 6 6 6 1 1 1 1 1 1 1 1 1 1 1 1 1 1 1 1 1 1 1 1 1 1
symmnumber: 1
zpe: 967552.8 jmol-1
zpe.correction: 0.368521 hartree
zpe.thermalcorrener: 0.390616 hartree
zpe.thermalcorrenthalpy: 0.391560 hartree
zpe.thermalcorrgfe: 0.313492 hartree
zpe.sumelectzpe: -1393.150124 hartree
zpe.sumelectthermal: -1393.128029 hartree
zpe.sumelectthermalent: -1393.127085 hartree
zpe.sumelectthermalfe: -1393.205153 hartree
dipole: 1.9270 -4.5115 -1.7319
dipole: 5.2025
quadrupole: -132.1179 -148.7565 -138.5066
quadrupole: 14.5144 -0.1458 -2.2004
quadrupole: 7.6758 -8.9628 1.2871 14.5144 -0.1458 -2.2004
hfenergy: -1393.5186451 hartree
pointgroup: C01 [X(C17H22Cl1N5)]
dipole: -0.4167286 -1.8011879 0.8783844 debye
polarizability: 239.019342|-3.9874554|254.9744959|-12.7008329|-17.5560753|188.9917724 unknown
InChI: InChI=1S/C17H22ClN5/c1-17(2,12-8-4-3-5-9-12)23-16-21-14(18)20-15(22-16)19-13-10-6-7-11-13/h3-5,8-9,13,19,23H,6-7,10-11H2,1-2H3
charge 0 multiplicity 1
45 atoms
Cl 1.467355 4.439527 -1.489482
N  2.237939 -0.052657 0.685527
N  -2.184447 1.521843 0.332504
N  0.018572 0.669784 0.564434
N  1.842203 2.033635 -0.339298
N  -0.443628 2.826709 -0.491289
C  3.69806 0.02524 0.459352
C  4.425289 -0.989473 1.374268
C  4.097677 -0.456468 -0.962903
C  4.313944 -2.360266 0.635029
C  4.076506 -2.0108 -0.87656
C  -2.90385 0.380397 0.964135
C  1.348031 0.901191 0.290853
C  -2.672166 -0.922962 0.158607
C  -2.484988 0.261704 2.452868
C  -4.416188 0.739944 0.882333
C  -0.835088 1.645646 0.147928
C  -2.640882 -2.192833 0.785731
C  -2.575463 -0.869734 -1.255712
C  0.881051 2.915477 -0.67216
C  -2.51179 -3.375966 0.022184
C  -2.444601 -2.047632 -2.021434
C  -2.413589 -3.31046 -1.385427
H  4.004672 1.069949 0.632355
H  4.016805 -1.009142 2.400919
H  5.484742 -0.684369 1.449092
H  5.119453 -0.089637 -1.178322
H  3.428702 -0.046233 -1.737088
H  3.472926 -2.95949 1.032208
H  5.22575 -2.965209 0.782051
H  4.844019 -2.461842 -1.529578
H  3.098544 -2.400471 -1.212467
H  1.831702 -0.885002 1.117842
H  -2.726165 2.326652 0.009425
H  -2.615749 1.240036 2.947993
H  -3.115434 -0.471524 2.985415
H  -1.427964 -0.037488 2.53288
H  -5.017863 -0.077305 1.312763
H  -4.629841 1.665108 1.450429
H  -4.735905 0.877047 -0.166798
H  -2.705557 -2.272211 1.875621
H  -2.583565 0.103859 -1.759559
H  -2.486695 -4.347778 0.528782
H  -2.36481 -1.980594 -3.112469
H  -2.312415 -4.227003 -1.977382
