program: Gaussian 09
title: 000189352
version: EM64L-G09RevD.01
frameworkgroup: C1[X(C14H17ClN2)]
method: RPBEPBE
basis: SDD
operation: Freq
keyword: #p
keyword: freq=noraman
keyword: PBEPBE/SDD
title: #p freq=noraman PBEPBE/SDD
converged: YES YES NO NO
title: Mulliken charges:
elementType: Cl N N C C C C C C C C C C C C C C H H H H H H H H H H H H H H H H H
charge: -0.056740 -0.191223 -0.084987 0.300471 -0.434280 -0.732891 -0.717508 -0.704977 0.264330 -0.243407 0.354812 -0.459842 -0.398355 -0.351579 -0.215791 -0.234122 -0.104243 0.234599 0.240682 0.206181 0.223423 0.240595 0.235680 0.220331 0.199681 0.214239 0.220638 0.212869 0.270132 0.266402 0.257328 0.255325 0.256747 0.255482
chargesum: 0.00000
title: Mulliken charges with hydrogens summed into heavy atoms:
elementType: Cl N N C C C C C C C C C C C C C C
charge: -0.056740 -0.191223 -0.084987 0.300471 0.041001 -0.062692 -0.061816 -0.057232 0.264330 0.026724 0.354812 -0.193440 -0.141027 -0.096254 0.040957 0.021360 -0.104243
polarizability: 2.49210055e+02 1.99378395e+01 1.76828820e+02 2.71153223e+00 -4.96809699e+00 1.04623555e+02
1716.lowfreq: 0.0005 0.0009 0.0015 1.1825 5.0448 7.1566 34.7286 41.3848 59.5402
frequency: 34.6792 41.3109 59.5115 73.0788 97.7495 140.3984 162.3183 213.1964 228.0650 244.3295 259.9402 277.9794 288.5570 292.9499 303.6009 350.3235 373.1445 382.4686 403.6049 415.9543 424.3802 479.5394 494.5298 533.7556 622.2506 642.2021 665.8686 711.1642 716.9794 737.5051 759.1639 781.2460 819.5221 829.1394 839.1399 880.5317 897.5030 901.0566 933.6157 934.9379 949.3011 952.0040 967.7759 993.1646 1012.7078 1024.3883 1037.2279 1075.6897 1107.5983 1117.1079 1131.2167 1187.8361 1204.0623 1216.5429 1221.7340 1253.3275 1264.4266 1288.5699 1295.0938 1323.4338 1346.2459 1359.0914 1364.3464 1376.2716 1378.3972 1396.3789 1404.2276 1425.8239 1461.9419 1462.7134 1467.1762 1470.4897 1476.6394 1485.3411 1491.9951 1500.4102 1534.4820 1573.6914 1605.3019 2970.1361 2971.4487 2975.8206 2990.6341 3062.3790 3063.4576 3068.0637 3070.8662 3074.2700 3077.4840 3081.9086 3148.8025 3159.7191 3172.9651 3185.0100 3224.1566 3252.1843
redmass: 4.1704 3.0116 5.7472 5.2413 3.7516 5.5159 4.1841 1.6791 1.7567 3.4976 3.1391 1.4896 1.7664 3.6787 1.4084 2.4964 4.1726 2.4521 2.0498 2.7191 2.8066 6.3212 3.1969 3.2481 6.2720 3.8794 3.7167 6.4731 3.6145 3.5814 4.5838 1.4186 1.4124 1.2746 1.5707 3.6530 2.1672 2.2726 1.5979 1.4952 1.2075 1.3415 1.3675 5.5220 3.3044 1.5065 1.4721 2.5650 1.3860 2.2162 1.9966 1.1215 2.2053 2.5968 1.7670 3.0766 3.3507 2.9221 1.2843 2.3882 2.2786 5.5732 1.5266 1.1989 1.2097 3.7456 1.2315 2.6588 1.7858 1.1457 1.0877 1.1031 1.1392 1.0628 1.0612 1.0644 5.8807 7.5155 6.4371 1.0350 1.0353 1.0369 1.0632 1.0996 1.0996 1.0988 1.0992 1.0997 1.0989 1.0988 1.0890 1.0894 1.0964 1.0948 1.0975 1.0982
irintensity: 0.8027 0.0955 0.5611 0.2767 0.6078 0.6496 1.1507 0.0728 0.0131 0.3735 0.6109 0.1166 0.2551 0.6061 0.9315 0.1858 1.1128 0.3838 0.3328 0.1190 1.8871 20.2309 19.4127 11.0566 0.9219 12.4298 6.2508 8.3666 3.6432 4.0159 5.3385 21.1789 63.6702 2.8639 34.5503 14.8857 12.9998 11.1622 2.2267 1.2517 0.0405 1.6894 0.9507 31.3148 4.1305 1.2215 0.0594 41.0979 6.0724 40.2408 1.8045 2.5415 55.6176 4.8910 2.9423 12.7940 13.8236 9.2143 0.7973 11.6013 0.5458 0.6278 2.5864 21.7336 23.3955 1.0387 22.5231 29.8351 51.0576 14.9848 1.1847 7.7751 10.5086 5.7879 20.5344 38.1802 48.2657 5.1549 0.1248 29.5709 41.8561 6.8055 34.0134 3.7661 8.5157 26.8851 38.1815 28.2581 64.7377 51.8091 3.9823 1.9619 4.4081 1.0609 4.7551 0.5007
temp: 298.150 k
press: 1.00000 atm
elementType: 17 7 7 6 6 6 6 6 6 6 6 6 6 6 6 6 6 1 1 1 1 1 1 1 1 1 1 1 1 1 1 1 1 1
symmnumber: 1
zpe: 729726.1 jmol-1
zpe.correction: 0.277938 hartree
zpe.thermalcorrener: 0.294431 hartree
zpe.thermalcorrenthalpy: 0.295375 hartree
zpe.thermalcorrgfe: 0.233297 hartree
zpe.sumelectzpe: -1111.996175 hartree
zpe.sumelectthermal: -1111.979682 hartree
zpe.sumelectthermalent: -1111.978738 hartree
zpe.sumelectthermalfe: -1112.040816 hartree
dipole: 1.6780 -3.5467 -1.1027
dipole: 4.0756
quadrupole: -113.1915 -116.5639 -109.9334
quadrupole: -16.6559 -2.1666 -4.3787
quadrupole: 0.0381 -3.3342 3.2962 -16.6559 -2.1666 -4.3787
hfenergy: -1112.2741126 hartree
pointgroup: C01 [X(C14H17Cl1N2)]
dipole: 0.2938768 -1.5738094 -0.0884699 debye
polarizability: 252.6543061|-1.5250329|165.1712556|-15.4700245|-20.5922219|112.8368681 unknown
InChI: InChI=1S/C14H17ClN2/c1-14(2,3)9-17-10-16-8-13(17)11-4-6-12(15)7-5-11/h4-8,10H,9H2,1-3H3
charge 0 multiplicity 1
34 atoms
Cl -5.551681 0.198076 0.503649
N  1.478189 0.31851 -0.584224
N  2.405566 2.400843 -0.657378
C  2.129533 -2.088524 0.14379
C  1.35995 -1.13694 -0.83372
C  3.665281 -1.876674 0.062231
C  1.670095 -1.891387 1.610282
C  1.798272 -3.534934 -0.317837
C  0.433193 1.241099 -0.311697
C  2.628177 1.079379 -0.801862
C  -0.993586 0.931415 -0.109284
C  1.044633 2.505252 -0.357504
C  -1.963814 1.748883 -0.758784
C  -1.461416 -0.109776 0.740261
C  -3.345974 1.539727 -0.572124
C  -2.841068 -0.341121 0.926657
C  -3.766287 0.4886 0.26576
H  1.717278 -1.337381 -1.863111
H  0.285567 -1.388323 -0.807708
H  4.024376 -1.903162 -0.984504
H  4.183176 -2.68218 0.614723
H  3.971022 -0.917377 0.515093
H  1.7416 -0.831387 1.915839
H  2.30987 -2.482632 2.290904
H  0.629346 -2.235992 1.758102
H  2.160053 -3.723415 -1.346494
H  2.283947 -4.269947 0.349384
H  0.708733 -3.727036 -0.296328
H  3.578224 0.638572 -1.087959
H  0.582132 3.469645 -0.157716
H  -1.626736 2.546675 -1.42862
H  -0.746277 -0.718992 1.29799
H  -4.079667 2.173187 -1.078782
H  -3.187307 -1.140182 1.588569
