program: Gaussian 09
title: 000189318
version: EM64L-G09RevD.01
frameworkgroup: C1[X(C14H13ClN4O6S)]
method: RPBEPBE
basis: SDD
operation: Freq
keyword: #p
keyword: freq=noraman
keyword: PBEPBE/SDD
title: #p freq=noraman PBEPBE/SDD
converged: YES YES NO NO
title: Mulliken charges:
elementType: Cl S O O O O O O N N N N C C C C C C C C C C C C C C H H H H H H H H H H H H H
charge: -0.021475 1.019877 -0.482717 -0.522107 -0.290121 -0.201412 -0.229288 -0.291523 -0.660196 -0.441983 -0.122327 0.149828 -0.163152 0.310511 -0.190741 -0.337258 -0.224619 -0.211627 0.347868 0.073333 0.177697 0.111329 -0.093872 -0.621281 -0.198605 -0.512844 0.311172 0.356602 0.276477 0.251263 0.245457 0.363938 0.275438 0.291239 0.250066 0.251722 0.262670 0.223021 0.267643
chargesum: 0.00000
title: Mulliken charges with hydrogens summed into heavy atoms:
elementType: Cl S O O O O O O N N N N C C C C C C C C C C C C C C
charge: -0.021475 1.019877 -0.482717 -0.522107 -0.290121 -0.201412 -0.229288 -0.291523 -0.303595 -0.078045 -0.122327 0.149828 -0.163152 0.310511 0.120431 -0.060781 0.026645 0.033830 0.347868 0.073333 0.177697 0.111329 0.181566 0.171746 -0.198605 0.240489
polarizability: 2.98843796e+02 3.83998924e+00 2.78160689e+02 2.92924090e+00 -7.12485643e-02 1.74211740e+02
1716.lowfreq: -6.3415 -1.6979 -0.0030 -0.0027 -0.0019 5.1344 13.3848 17.4326 26.1531
frequency: 12.7229 17.3857 26.1422 37.0766 48.5317 61.3353 63.0805 65.1277 90.0502 95.7635 100.6987 112.0366 120.4447 132.5033 151.2275 170.2695 172.0830 213.9062 219.4227 226.5779 234.1022 251.1207 269.3776 284.0364 295.2381 321.9017 324.9783 340.5461 354.2633 358.6570 364.5074 381.9177 426.8824 450.1640 480.1843 484.0909 502.5852 526.4646 543.4100 573.7496 590.4668 627.3783 669.6376 673.7366 679.2936 695.3322 724.7974 740.5966 743.0611 768.2731 771.6810 786.8830 799.9292 821.4620 828.1774 881.0087 895.6396 908.8126 928.1653 963.8627 978.1455 986.7240 1007.2061 1026.9594 1031.1674 1072.0430 1082.8914 1100.9446 1114.4993 1121.6421 1123.7692 1153.0267 1154.7808 1178.9480 1225.1327 1245.9331 1262.1266 1272.4604 1308.8045 1319.7831 1371.4344 1376.8376 1411.1818 1423.5836 1423.9849 1452.5262 1459.6112 1468.3796 1472.8960 1489.4390 1490.9331 1542.4272 1559.6983 1563.1278 1582.7618 1604.4077 1632.8478 1645.7306 3004.8598 3008.4167 3099.7578 3121.8213 3132.7607 3143.1022 3147.1427 3160.4251 3170.9944 3181.5556 3199.8500 3420.8573 3526.5737
redmass: 9.4403 7.2750 4.7164 3.9846 2.8473 8.4450 2.0434 5.7340 3.2690 1.1079 3.9321 5.4773 9.7605 7.0419 6.7446 6.7046 5.2229 7.2794 6.2185 6.3812 6.4448 7.1934 8.1419 5.5179 4.8800 3.9042 2.0490 6.6390 6.0970 5.6827 10.0840 6.6042 4.8906 10.4064 5.6550 5.1111 7.4214 5.3619 7.8860 7.2149 5.6727 6.7204 6.0858 5.7179 6.1642 5.0353 1.8744 3.7368 3.5550 5.6386 3.0989 1.7131 1.3659 15.7762 6.8341 8.5215 1.5523 5.1507 8.3019 8.8660 1.4455 7.4005 1.3740 2.7768 3.3047 3.0843 2.4799 2.0970 1.4516 1.5585 1.3184 1.9055 1.5246 1.0653 2.3154 2.6507 6.3460 1.6782 2.1534 2.6713 2.8958 5.9093 1.1951 2.2884 1.3035 1.0555 2.4398 1.1587 1.0533 1.9335 1.0498 10.6574 4.4586 5.8946 10.0172 7.1088 10.3910 8.2483 1.0335 1.0282 1.1032 1.1052 1.1009 1.1058 1.0868 1.0908 1.0950 1.1000 1.0958 1.0759 1.0787
irintensity: 0.7494 0.6610 0.3521 3.5184 0.5532 5.5182 4.6727 4.7785 2.2108 1.9184 12.1472 2.3724 0.8875 1.8227 4.6534 2.0986 0.8238 0.8113 5.4976 5.6214 4.2601 6.9425 1.7267 9.4713 38.8386 12.2070 55.3300 41.3129 2.9202 5.4285 1.5098 19.9870 3.0430 113.8418 16.6692 9.5572 8.2350 28.5293 120.3258 23.1358 3.3603 4.7430 12.9155 24.9462 60.5808 83.2419 56.9462 47.7547 9.7744 8.7576 76.5472 22.0695 33.2743 126.4787 46.0846 25.8937 7.5119 11.5606 43.0724 82.2868 4.5456 8.2086 0.5081 18.9232 43.5238 26.3866 69.4276 355.2327 6.7807 16.7460 0.3270 110.5804 31.8230 0.1970 15.4976 199.9819 59.9670 45.1720 529.8834 18.5260 64.5576 4.7307 48.9050 16.2291 47.4086 14.1692 2.1828 177.6980 12.1039 776.3660 31.6032 369.3342 203.9414 7.3634 138.9859 14.8889 218.3583 89.5642 39.9901 26.2815 15.4090 10.8663 0.1904 11.4582 3.4000 4.6274 3.6340 15.6226 2.8241 79.2361 43.9702
temp: 298.150 k
press: 1.00000 atm
elementType: 17 16 8 8 8 8 8 8 7 7 7 7 6 6 6 6 6 6 6 6 6 6 6 6 6 6 1 1 1 1 1 1 1 1 1 1 1 1 1
symmnumber: 1
zpe: 696583.5 jmol-1
zpe.correction: 0.265315 hartree
zpe.thermalcorrener: 0.291797 hartree
zpe.thermalcorrenthalpy: 0.292741 hartree
zpe.thermalcorrgfe: 0.204674 hartree
zpe.sumelectzpe: -2067.697960 hartree
zpe.sumelectthermal: -2067.671478 hartree
zpe.sumelectthermalent: -2067.670534 hartree
zpe.sumelectthermalfe: -2067.758601 hartree
dipole: -5.5329 0.1318 -4.8801
dipole: 7.3788
quadrupole: -137.3154 -156.7035 -174.0552
quadrupole: 23.9055 -0.5507 8.3792
quadrupole: 18.7093 -0.6788 -18.0305 23.9055 -0.5507 8.3792
hfenergy: -2067.9632747 hartree
pointgroup: C01 [X(C14H13Cl1N4O6S1)]
dipole: 2.0786451 0.8773561 -1.8267618 debye
polarizability: 298.846674|6.2196479|248.0515508|-5.9733716|46.6041506|204.3180004 unknown
InChI: InChI=1S/C14H13ClN4O6S/c1-19-7-10(15)16-11(12(19)20)17-14(22)18-26(23,24)9-6-4-3-5-8(9)13(21)25-2/h3-7,17-18H,1-2H3
charge 0 multiplicity 1
39 atoms
Cl 4.105051 -2.424754 -2.729021
S  -2.187113 0.051677 1.736308
O  -1.990064 -1.162919 2.779548
O  -2.995336 1.379545 2.192429
O  -2.461246 2.185271 -0.476652
O  0.296135 -1.373493 0.533843
O  -4.621012 2.189934 -1.362037
O  3.942141 1.991007 1.173784
N  -0.515719 0.695912 1.289979
N  1.722942 0.523808 0.724524
N  5.194417 0.691666 -0.3632
N  2.886708 -0.831331 -0.885454
C  -2.8830 -0.70134 0.114104
C  -3.52524 0.073491 -0.877176
C  -2.7956 -2.100003 0.071308
C  -4.140799 -0.635133 -1.943719
C  -3.387444 -2.774474 -1.020282
C  -4.067946 -2.041087 -2.01828
C  0.48462 -0.166744 0.809482
C  2.856562 0.156694 0.008238
C  -3.630905 1.568411 -0.91709
C  4.019122 1.028857 0.336493
C  5.230845 -0.35707 -1.287338
C  6.4214 1.479303 -0.100877
C  4.069071 -1.072932 -1.514838
C  -2.532177 3.658878 -0.297594
H  -2.283933 -2.63747 0.874701
H  -0.51881 1.709154 1.134904
H  -4.670564 -0.054564 -2.705548
H  -3.320172 -3.865037 -1.080058
H  -4.541402 -2.563848 -2.855472
H  1.889357 1.342223 1.329256
H  6.178684 -0.559508 -1.786347
H  6.177459 2.2393 0.656026
H  6.759086 1.974686 -1.026863
H  7.219551 0.820128 0.280011
H  -3.174773 4.10687 -1.071777
H  -1.496223 4.017729 -0.384086
H  -2.943172 3.859067 0.705872
