program: Gaussian 09
title: 000189315
version: EM64L-G09RevD.01
frameworkgroup: C1[X(C16H9NO3)]
method: RPBEPBE
basis: SDD
operation: Freq
keyword: #p
keyword: freq=noraman
keyword: PBEPBE/SDD
title: #p freq=noraman PBEPBE/SDD
converged: NO YES NO NO
title: Mulliken charges:
elementType: O O O N C C C C C C C C C C C C C C C C H H H H H H H H H
charge: -0.412922 -0.212440 -0.216351 0.017273 -0.484545 0.398606 0.277102 -0.025140 0.299762 0.394270 -0.385512 0.263044 -0.414574 0.171788 -0.468952 -0.388354 -0.462597 -0.204521 -0.362526 -0.193838 0.220964 0.255985 0.258058 0.303400 0.285838 0.232493 0.257367 0.235521 0.360803
chargesum: 0.00000
title: Mulliken charges with hydrogens summed into heavy atoms:
elementType: O O O N C C C C C C C C C C C C C C C C
charge: -0.052119 -0.212440 -0.216351 0.017273 -0.484545 0.398606 0.277102 -0.025140 0.299762 0.394270 -0.164548 0.263044 -0.158589 0.171788 -0.210894 -0.084954 -0.176759 0.027971 -0.105159 0.041683
polarizability: 3.65065264e+02 7.87612470e-01 2.35507014e+02 -6.07854833e-03 1.63382358e-02 7.01526510e+01
1716.lowfreq: -6.4071 -4.3173 -1.0305 -0.0008 0.0004 0.0005 33.7073 57.8845 65.0081
frequency: 33.7036 57.8800 64.9758 123.0954 148.2062 176.6178 225.7839 230.5142 261.6065 293.4531 297.9015 320.1621 346.3858 375.0364 434.3580 457.3656 461.5330 490.8675 520.1763 539.7439 558.5260 576.0224 585.9004 612.1431 636.0164 640.6492 648.1206 694.5674 730.9340 737.1731 775.5680 784.3000 792.5911 796.2386 826.7896 842.1680 883.5509 901.3394 936.1239 939.4310 974.9907 977.4324 1002.2445 1031.1071 1039.1211 1051.2243 1099.3804 1122.6718 1147.2175 1160.9882 1181.8944 1191.6055 1194.7899 1213.6734 1265.9290 1283.5480 1297.3924 1331.5517 1353.8798 1392.1432 1397.5855 1411.0908 1426.8472 1449.3692 1467.8036 1477.0703 1494.4904 1584.2683 1596.8777 1602.3633 1617.6855 1622.6819 3122.9069 3137.1622 3141.3499 3156.8928 3159.4212 3178.8571 3178.9279 3212.7661 3602.1909
redmass: 13.8081 6.2673 4.2393 4.4068 7.6229 4.0213 3.5580 8.7894 4.0285 6.9639 1.5241 5.9850 4.5894 8.8008 4.8691 7.1848 3.1165 6.4083 3.7965 6.9152 6.6804 4.8163 5.8614 6.8212 5.1531 8.1379 3.3550 5.4886 2.6620 8.6072 6.9593 2.3145 6.0632 1.4320 1.5259 2.6433 7.1335 1.4682 6.2860 1.4515 1.3672 1.3666 1.3562 4.3709 2.6299 2.1063 2.1782 1.4053 2.3474 1.7308 1.4915 2.3203 1.8643 1.8969 3.4913 2.4056 1.7938 2.7213 4.7087 2.7528 3.5554 4.2388 4.2092 3.5957 4.0209 4.7279 4.3491 7.1741 8.4820 7.2956 7.8207 7.1472 1.0906 1.0882 1.0872 1.0953 1.0941 1.0943 1.0956 1.0938 1.0657
irintensity: 0.0000 2.2968 0.8794 0.2833 3.3823 0.1624 15.3359 0.5667 3.2654 0.2087 112.0873 4.3780 6.2536 3.0947 0.2379 0.2654 2.3933 13.0812 0.6478 9.4506 0.2753 3.2882 1.4284 3.6627 1.5044 0.5183 0.0729 12.1432 5.1578 19.8263 1.4656 5.9164 4.3813 143.9465 29.8227 8.5696 30.1110 0.1092 6.1820 0.0137 1.4705 4.1222 2.1784 5.1605 28.6958 3.3339 8.9126 131.2579 13.7378 232.8601 121.1492 143.1620 247.6731 144.6948 0.5057 12.1710 1.5164 29.1794 67.8314 1.4615 23.7542 2.0942 12.6162 37.7615 14.3312 38.0522 71.8745 83.0149 29.5526 111.6114 7.6635 23.9429 24.8685 9.9585 2.4567 10.7065 21.0886 1.4973 15.3721 6.2411 16.4529
temp: 298.150 k
press: 1.00000 atm
elementType: 8 8 8 7 6 6 6 6 6 6 6 6 6 6 6 6 6 6 6 6 1 1 1 1 1 1 1 1 1
symmnumber: 1
zpe: 544952.3 jmol-1
zpe.correction: 0.207561 hartree
zpe.thermalcorrener: 0.222271 hartree
zpe.thermalcorrenthalpy: 0.223216 hartree
zpe.thermalcorrgfe: 0.165346 hartree
zpe.sumelectzpe: -894.124672 hartree
zpe.sumelectthermal: -894.109962 hartree
zpe.sumelectthermalent: -894.109018 hartree
zpe.sumelectthermalfe: -894.166887 hartree
dipole: 5.0278 1.4276 0.0018
dipole: 5.2265
quadrupole: -134.8953 -97.8628 -118.3366
quadrupole: 0.9193 0.0059 -0.0162
quadrupole: -17.8637 19.1688 -1.3050 0.9193 0.0059 -0.0162
hfenergy: -894.3322332 hartree
pointgroup: C01 [X(C16H9N1O3)]
dipole: -1.9778134 -0.5625994 0.000904 debye
polarizability: 365.0603126|0.8622215|235.4769644|1.1014388|-2.256592|70.1876528 unknown
InChI: InChI=1S/C16H9NO3/c18-14-6-2-4-10-9-3-1-5-11-13(17(19)20)8-7-12(15(9)11)16(10)14/h1-8,18H
charge 0 multiplicity 1
29 atoms
O  -2.992398 2.753668 -0.063989
O  4.494279 1.901106 -0.027521
O  4.585403 -0.370968 0.008219
N  3.920943 0.739928 -0.011953
C  0.289069 -0.399713 -0.010338
C  -0.409338 0.859592 -0.030074
C  -0.641312 -1.487188 0.000765
C  -1.852647 0.543721 -0.031155
C  -1.998821 -0.893478 -0.012404
C  1.70323 -0.561304 -0.002546
C  0.359538 2.035169 -0.043264
C  2.439604 0.685259 -0.016868
C  -0.152024 -2.795254 0.020371
C  -3.009954 1.354085 -0.04594
C  -3.265543 -1.494661 -0.008972
C  2.18315 -1.920105 0.017974
C  1.778914 1.928516 -0.036442
C  1.268416 -2.986068 0.028706
C  -4.29391 0.74727 -0.042684
C  -4.414162 -0.655353 -0.024451
H  -0.070202 3.043432 -0.0588
H  -0.818385 -3.664029 0.029419
H  -3.378282 -2.582954 0.005254
H  3.255705 -2.112364 0.025207
H  2.398434 2.829442 -0.046541
H  1.660486 -4.008935 0.044212
H  -5.174849 1.395299 -0.054452
H  -5.413662 -1.102596 -0.022139
H  -2.070583 3.109382 -0.063992
