program: Gaussian 09
title: 000189314
version: EM64L-G09RevD.01
frameworkgroup: C1[X(C16H9NO3)]
method: RPBEPBE
basis: SDD
operation: Freq
keyword: #p
keyword: freq=noraman
keyword: PBEPBE/SDD
title: #p freq=noraman PBEPBE/SDD
converged: NO YES NO YES
title: Mulliken charges:
elementType: O O O N C C C C C C C C C C C C C C C C H H H H H H H H H
charge: -0.417535 -0.211143 -0.216555 0.018348 -0.480722 0.268350 0.401709 -0.038049 0.314138 0.394924 -0.411764 -0.400067 0.254493 0.170503 -0.463687 -0.381898 -0.414479 -0.239530 -0.361115 -0.197300 0.261608 0.216151 0.258180 0.304502 0.286876 0.230808 0.256924 0.236141 0.360188
chargesum: 0.00000
title: Mulliken charges with hydrogens summed into heavy atoms:
elementType: O O O N C C C C C C C C C C C C C C C C
charge: -0.057346 -0.211143 -0.216555 0.018348 -0.480722 0.268350 0.401709 -0.038049 0.314138 0.394924 -0.150156 -0.183916 0.254493 0.170503 -0.205507 -0.077396 -0.127603 -0.008721 -0.104190 0.038840
polarizability: 3.61306687e+02 -1.31790658e+01 2.35532666e+02 -9.62432444e-03 -3.64338420e-03 7.01485719e+01
1716.lowfreq: -6.6958 -0.0007 0.0004 0.0007 5.0656 10.4795 33.7322 50.9073 73.5234
frequency: 33.7304 50.8934 73.5227 134.7777 150.1043 164.0549 215.0405 237.4599 258.7167 282.1546 301.5430 334.3665 357.0414 382.1325 433.1556 435.4501 459.2701 504.9880 526.5330 531.4148 561.2291 571.2332 576.8159 617.4323 620.4323 643.6388 657.0123 696.4741 723.8262 735.9636 772.7056 780.2402 798.9275 800.8996 824.0789 854.9488 873.3831 902.0870 903.8344 970.6599 974.1994 992.7875 998.0553 999.1009 1047.7006 1062.1493 1113.1312 1118.5401 1130.8740 1165.1821 1183.5212 1188.0812 1198.2638 1212.8531 1259.0179 1289.0523 1298.1026 1332.0546 1353.4368 1394.3251 1396.3178 1410.7226 1427.9136 1451.5402 1466.3602 1476.1284 1494.2097 1586.4930 1596.9813 1608.6658 1615.7385 1617.5684 3110.0330 3141.3135 3151.2411 3152.6003 3158.4605 3177.4466 3180.5614 3214.4382 3600.0921
redmass: 14.0843 6.4252 4.2627 5.4468 7.3566 3.2915 3.6229 7.5018 8.9270 3.7232 1.4522 6.6518 6.4293 6.6868 7.3379 4.7697 3.1207 6.8287 4.1208 7.4908 5.8595 6.7701 3.9754 6.0259 6.1721 8.6832 3.4287 5.2582 2.8380 9.1620 1.6021 5.7726 1.6758 6.9029 3.3572 6.9771 1.4695 1.4497 1.5024 5.6434 1.3637 1.3669 1.3394 5.5364 2.2290 2.2680 1.8292 1.8477 1.8990 1.5222 1.8541 2.8190 1.5476 1.9896 3.0831 2.1196 2.0225 2.8927 4.4136 3.7935 2.5917 4.6982 3.8280 3.8424 3.9553 4.7370 4.3613 7.0536 8.6179 6.9259 8.0411 7.3776 1.0899 1.0872 1.0929 1.0908 1.0932 1.0979 1.0937 1.0938 1.0658
irintensity: 0.0010 0.0718 3.6304 5.6535 4.0805 1.1788 8.9391 0.1742 1.1033 13.7878 106.4075 0.2288 2.7406 5.4900 3.5510 0.0856 2.3451 9.2638 0.4689 2.4526 1.4995 4.8120 3.7680 0.8347 2.4358 5.4873 0.9277 0.7942 35.2086 15.9353 5.6234 0.6474 137.2809 5.5987 0.1631 27.8323 28.2939 0.8414 0.2349 9.5839 1.3355 0.9283 1.7851 3.6102 35.9961 0.3762 30.5464 67.7208 167.6803 28.9745 116.4593 401.8763 30.9531 109.7464 28.6421 4.4939 7.5793 61.2292 32.3371 25.5721 2.6283 12.8601 4.1616 35.0661 60.9494 38.3261 11.8319 45.6715 44.3612 43.5876 13.8723 18.6400 26.0679 3.9127 22.1645 1.5723 14.0928 15.5040 2.5434 7.1005 16.9359
temp: 298.150 k
press: 1.00000 atm
elementType: 8 8 8 7 6 6 6 6 6 6 6 6 6 6 6 6 6 6 6 6 1 1 1 1 1 1 1 1 1
symmnumber: 1
zpe: 544883.6 jmol-1
zpe.correction: 0.207535 hartree
zpe.thermalcorrener: 0.222244 hartree
zpe.thermalcorrenthalpy: 0.223188 hartree
zpe.thermalcorrgfe: 0.165345 hartree
zpe.sumelectzpe: -894.124584 hartree
zpe.sumelectthermal: -894.109875 hartree
zpe.sumelectthermalent: -894.108931 hartree
zpe.sumelectthermalfe: -894.166775 hartree
dipole: 4.8614 -0.1723 0.0010
dipole: 4.8645
quadrupole: -140.7754 -93.4387 -118.3362
quadrupole: -4.5134 -0.0020 0.0068
quadrupole: -23.2586 24.0780 -0.8194 -4.5134 -0.0020 0.0068
hfenergy: -894.3321193 hartree
pointgroup: C01 [X(C16H9N1O3)]
dipole: -1.9135638 -0.0291328 -0.0131605 debye
polarizability: 361.7759849|10.6392942|235.029745|1.8628456|-1.8223885|70.1821947 unknown
InChI: InChI=1S/C16H9NO3/c18-14-6-2-3-9-10-7-8-13(17(19)20)11-4-1-5-12(15(10)11)16(9)14/h1-8,18H
charge 0 multiplicity 1
29 atoms
O  -3.908135 1.937058 -0.062557
O  4.800184 -1.435496 0.035397
O  4.536423 0.822552 0.008666
N  4.053264 -0.378369 0.018668
C  0.290548 0.185688 -0.014432
C  -0.191308 -1.164962 -0.002241
C  -0.808948 1.111165 -0.032605
C  -2.046571 0.291004 -0.031556
C  -1.666958 -1.100683 -0.013053
C  1.662927 0.563088 -0.009158
C  0.736774 -2.213444 0.016332
C  -0.514209 2.480003 -0.046358
C  2.58046 -0.556528 0.010186
C  -3.416346 0.625177 -0.044194
C  -2.629069 -2.124392 -0.007594
C  1.92987 1.97934 -0.023611
C  2.122876 -1.889672 0.022329
C  0.860717 2.88746 -0.041534
C  -4.393094 -0.406963 -0.038539
C  -4.002002 -1.760299 -0.020567
H  0.42886 -3.26334 0.026353
H  -1.280225 3.265201 -0.060771
H  -2.336738 -3.178865 0.006434
H  2.959027 2.336886 -0.020523
H  2.87631 -2.681795 0.036821
H  1.08661 3.959345 -0.052385
H  -5.448787 -0.120299 -0.048595
H  -4.772921 -2.537552 -0.016589
H  -3.175841 2.600488 -0.065821
