program: Gaussian 09
title: 000189310
version: EM64L-G09RevD.01
frameworkgroup: C1[X(C14H11NO5)]
method: RPBEPBE
basis: SDD
operation: Freq
keyword: #p
keyword: freq=noraman
keyword: PBEPBE/SDD
title: #p freq=noraman PBEPBE/SDD
converged: YES YES NO NO
title: Mulliken charges:
elementType: O O O O O N C C C C C C C C C C C C C C H H H H H H H H H H H
charge: -0.415023 -0.490978 -0.285099 -0.448017 -0.304097 -0.511377 0.370436 0.029487 0.082955 -0.466929 0.145685 -0.266349 0.318436 0.245430 -0.419804 -0.292841 -0.389745 -0.257347 0.127180 -0.194842 0.477358 0.346721 0.278217 0.227257 0.284212 0.221271 0.234242 0.231865 0.359014 0.380948 0.381732
chargesum: 0.00000
title: Mulliken charges with hydrogens summed into heavy atoms:
elementType: O O O O O N C C C C C C C C C C C C C C
charge: -0.056009 -0.110029 -0.285099 -0.066285 -0.304097 -0.034019 0.370436 0.029487 0.082955 -0.120208 0.145685 0.011868 0.318436 0.245430 -0.192546 -0.008629 -0.168473 -0.023106 0.127180 0.037023
polarizability: 3.00280163e+02 -8.56431476e+00 2.19001777e+02 1.18536379e+00 7.88000456e-01 6.80781146e+01
1716.lowfreq: -8.6685 -5.5919 -3.0667 -0.0010 -0.0008 -0.0004 7.7456 32.8843 56.9956
frequency: 6.8492 32.8307 56.9950 92.0271 96.9251 118.6187 136.1140 168.9149 188.8889 233.6515 268.8663 271.4320 298.2862 334.3049 337.2022 354.3857 373.8909 394.2142 404.5958 436.2506 455.8015 509.1111 517.9302 527.5732 550.3930 561.9983 564.2612 586.6417 625.8217 651.9235 677.9194 680.4735 701.4450 748.4934 755.4251 759.8873 771.7379 805.2836 811.2873 858.0687 869.6520 936.6000 960.5230 960.8772 966.9008 978.1201 996.2241 1002.1975 1031.5359 1058.0144 1075.0300 1111.8647 1136.6258 1149.8935 1169.9070 1170.3592 1205.4062 1219.1011 1248.5591 1258.9340 1287.1159 1296.3507 1318.8357 1391.1706 1396.4958 1435.2557 1449.4959 1470.2923 1485.4090 1510.7367 1554.6750 1580.8840 1607.0203 1613.8415 1623.9045 1645.0108 3119.8384 3130.3207 3143.0369 3157.7272 3173.3382 3185.1397 3203.1650 3209.8658 3536.9408 3576.7968 3625.2867
redmass: 6.5109 7.0565 11.5187 5.7392 6.2125 6.4004 5.6817 7.7537 7.3997 5.4828 6.9592 5.4738 5.1769 6.9135 1.1346 8.8510 6.9791 1.1266 5.2441 3.4737 2.9219 5.9268 5.8675 3.4323 6.2485 5.8181 1.2044 6.4728 4.6323 6.3768 3.9944 4.5159 5.5263 6.6593 2.2545 3.6627 1.9299 1.7057 6.4557 1.4572 7.0250 1.3912 1.3426 1.3507 3.7088 1.1136 5.4576 1.3342 2.6952 2.0907 2.2145 1.8539 1.3242 1.3072 1.4813 1.1037 1.8615 2.4333 2.2541 2.4877 1.5804 2.3901 2.6694 8.8937 7.4912 2.5956 3.5723 2.8467 2.8776 2.5963 8.0910 4.3573 6.6136 6.8319 4.8920 4.2614 1.0883 1.0908 1.0891 1.0931 1.0997 1.0941 1.0925 1.0835 1.0641 1.0660 1.0669
irintensity: 0.1317 7.0317 0.1687 0.0404 2.6815 0.3797 0.0956 4.8556 0.0175 1.2601 0.7710 0.2817 3.6293 10.4641 119.9121 1.5024 5.3071 135.4262 32.4272 0.3928 40.4477 11.9984 22.9403 9.9981 10.6347 52.5555 110.4660 6.8156 0.0184 3.0502 71.2630 1.2996 5.9450 11.6649 60.5824 8.8843 38.3586 30.3861 6.5367 0.1344 14.7154 31.5283 3.7621 4.9038 78.9108 114.5200 271.4327 0.6717 26.6479 49.5692 143.4643 251.1303 50.8049 59.2306 95.7341 20.1832 28.4557 26.3555 91.2732 26.5571 105.8683 131.2819 201.7247 20.5015 19.9332 49.2284 93.4962 134.6225 49.8688 680.5818 230.6879 277.6952 153.0448 7.0976 84.3256 248.3760 7.7943 14.2845 11.3559 6.3501 27.5329 1.7750 31.1858 168.7369 55.4547 62.8954 60.8201
temp: 298.150 k
press: 1.00000 atm
elementType: 8 8 8 8 8 7 6 6 6 6 6 6 6 6 6 6 6 6 6 6 1 1 1 1 1 1 1 1 1 1 1
symmnumber: 1
zpe: 591918.2 jmol-1
zpe.correction: 0.225450 hartree
zpe.thermalcorrener: 0.242666 hartree
zpe.thermalcorrenthalpy: 0.243610 hartree
zpe.thermalcorrgfe: 0.178404 hartree
zpe.sumelectzpe: -969.586476 hartree
zpe.sumelectthermal: -969.569260 hartree
zpe.sumelectthermalent: -969.568316 hartree
zpe.sumelectthermalfe: -969.633522 hartree
dipole: 0.1736 3.9636 -0.0562
dipole: 3.9678
quadrupole: -74.6373 -105.7835 -120.2168
quadrupole: -9.9713 0.1754 0.2905
quadrupole: 25.5752 -5.5709 -20.0043 -9.9713 0.1754 0.2905
hfenergy: -969.8119256 hartree
pointgroup: C01 [X(C14H11N1O5)]
dipole: 0.0497148 -1.052149 -1.1521184 debye
polarizability: 296.9536227|26.2500492|137.0984641|-13.3895433|73.1363991|153.3079686 unknown
InChI: InChI=1S/C14H11NO5/c16-8-5-6-9(14(19)20)11(7-8)15-13(18)10-3-1-2-4-12(10)17/h1-7,15-17,19H
charge 0 multiplicity 1
31 atoms
O  3.841355 2.302227 1.936216
O  -1.928721 -1.325488 -1.238661
O  -0.655502 1.374917 1.750396
O  2.88673 -2.03733 -2.61015
O  0.660944 -1.834247 -2.023723
N  0.053301 -0.048633 0.012258
C  1.443311 0.205564 0.05722
C  2.336821 -0.489182 -0.85124
C  -2.365527 0.111444 0.636295
C  2.003518 1.132974 0.975362
C  -0.925394 0.528287 0.838094
C  3.732318 -0.217696 -0.793894
C  3.390423 1.369408 0.995846
C  -2.863354 -0.784867 -0.351616
C  4.275899 0.699159 0.111992
C  -3.309099 0.678125 1.535027
C  -4.238626 -1.104352 -0.434913
C  -4.680591 0.370355 1.465229
C  1.858109 -1.471724 -1.831375
C  -5.147242 -0.527422 0.475398
H  -0.273003 -0.728383 -0.706593
H  1.3533 1.664709 1.669207
H  4.383137 -0.754407 -1.487908
H  5.355451 0.890133 0.13501
H  -2.915443 1.367888 2.288256
H  -4.592275 -1.797734 -1.208607
H  -5.381087 0.822846 2.173914
H  -6.211828 -0.776832 0.409524
H  4.823691 2.412491 1.885425
H  -2.29831 -1.983016 -1.873585
H  2.469792 -2.685114 -3.238305
