program: Gaussian 09
title: 000189307
version: EM64L-G09RevD.01
frameworkgroup: C1[X(C17H19NO5)]
method: RPBEPBE
basis: SDD
operation: Freq
keyword: #p
keyword: freq=noraman
keyword: PBEPBE/SDD
title: #p freq=noraman PBEPBE/SDD
converged: YES YES NO NO
title: Mulliken charges:
elementType: O O O O O N C C C C C C C C C C C C C C C C C H H H H H H H H H H H H H H H H H H H
charge: -0.264965 -0.456336 -0.226446 -0.255241 -0.258515 -0.106208 -0.180586 -0.077086 -0.192928 -0.167890 -0.523187 -0.538332 -0.123260 -0.410075 0.358787 -0.675807 0.060082 -0.501857 0.110161 -0.503556 0.174530 0.177820 -0.203921 0.221099 0.281837 0.286389 0.252653 0.236183 0.214842 0.231587 0.226628 0.225652 0.233165 0.210276 0.231662 0.245291 0.206140 0.334819 0.366317 0.296459 0.241793 0.242023
chargesum: 0.00000
title: Mulliken charges with hydrogens summed into heavy atoms:
elementType: O O O O O N C C C C C C C C C C C C C C C C C
charge: -0.264965 -0.090018 -0.226446 -0.255241 -0.258515 -0.106208 0.040513 0.204751 0.093461 0.084763 -0.072162 -0.080117 0.102392 0.033365 0.358787 0.007287 0.060082 -0.167039 0.110161 -0.207097 0.174530 0.177820 0.279895
polarizability: 2.59200982e+02 1.00972832e+01 2.22154538e+02 -2.83644234e+00 4.62362343e+00 1.29338533e+02
1716.lowfreq: -12.4029 -7.8315 -0.0005 0.0002 0.0007 1.7879 5.4569 43.5349 61.7257
frequency: -11.9630 43.4967 61.6958 83.4884 104.7353 109.3765 122.2924 132.5458 153.5060 195.9184 216.9707 219.7289 239.1987 254.2595 282.2210 300.0740 312.1792 343.5827 358.9142 361.3661 393.8579 415.1200 436.7875 454.9159 456.6886 494.6717 531.4095 565.1664 572.3256 601.2660 630.4722 649.8105 668.8042 681.5400 703.6747 707.7459 735.5198 751.8215 777.7302 790.2311 805.3629 830.1915 839.7119 856.4420 870.7713 906.0276 913.9497 924.3393 942.2775 959.8831 970.1679 980.1978 987.6268 993.8554 1008.5849 1051.1567 1055.1828 1065.1146 1067.9779 1085.1707 1110.4751 1119.5951 1124.6588 1131.7441 1138.1217 1152.5398 1174.7888 1178.7947 1188.2691 1192.1113 1215.7326 1224.6934 1238.3235 1254.3623 1263.3381 1268.8846 1279.2161 1295.0716 1303.6275 1310.0409 1316.5606 1321.4725 1344.8043 1352.7970 1359.2373 1362.3908 1378.0724 1381.0766 1406.9392 1423.7010 1433.1579 1451.3577 1468.6657 1470.5847 1477.0037 1479.4511 1483.3011 1487.5223 1605.1198 1613.5828 1645.9918 2901.5909 2915.0507 2966.2838 2971.5484 2981.6671 2991.6887 2992.4148 3005.4204 3010.0791 3018.0499 3031.3156 3056.7907 3060.0946 3079.3047 3084.9220 3097.9833 3116.1699 3185.5591 3534.8900
redmass: 2.2556 5.9721 4.6269 2.8128 6.4775 5.2737 4.4045 4.3792 4.2998 3.5812 1.1351 5.9044 6.1807 5.7191 5.9429 4.8321 5.6738 3.3831 5.5855 2.6555 3.3231 2.8185 3.7294 2.8159 1.5527 3.2284 4.6983 5.3068 5.2167 5.9140 7.0795 5.0560 4.2771 9.8162 6.8959 8.0844 5.4497 4.9527 5.8117 1.4733 3.6119 3.5763 7.6145 3.4060 2.5099 1.4624 3.2690 2.3143 4.5828 1.6167 4.2887 2.4762 2.9872 3.1362 2.2791 5.2965 3.1685 1.4577 1.9172 2.6395 1.6751 1.0375 1.9207 2.2855 2.1981 1.7068 2.5568 1.4454 1.6666 1.5325 1.4688 1.3129 1.3590 1.4958 1.2999 1.4550 2.4833 1.4205 1.2745 1.4787 1.3583 1.4633 1.3963 1.4257 1.5725 1.3346 1.4967 1.5851 5.7976 6.2627 1.1563 1.0918 1.2432 1.7996 1.0855 1.0704 1.0708 1.3229 9.7527 8.4407 11.9903 1.0515 1.0818 1.0800 1.0777 1.0755 1.0647 1.0810 1.0690 1.0754 1.0535 1.0794 1.1001 1.1000 1.1021 1.1018 1.1190 1.0963 1.0935 1.0652
irintensity: 13.6033 0.5971 0.2872 1.0673 3.0808 1.0452 2.9553 0.3205 3.4875 0.2841 0.1249 7.1387 0.7540 0.4214 8.5293 0.8543 1.6902 9.5560 0.7952 0.6932 1.7959 2.0447 12.4534 42.2319 134.7184 38.1903 27.3295 17.1339 9.2859 4.3449 9.5113 10.1739 6.9903 2.3185 4.8885 5.7361 4.6627 4.7722 16.6619 9.5552 31.2257 4.8528 45.3213 6.2249 27.4338 18.2086 15.9702 9.3392 26.7278 72.2929 233.9443 23.5227 20.2511 4.8422 70.0162 112.1087 11.3056 4.3832 6.1615 7.1591 7.3106 0.0370 4.5515 26.3973 2.1184 6.9221 55.3804 15.2770 58.2510 6.8596 34.6398 20.2842 21.1816 62.0268 12.9724 13.2174 229.6800 44.5917 9.5208 10.2692 9.5009 17.0491 0.0703 14.6481 11.4096 5.4288 6.8637 8.5599 3.8235 25.4118 6.0334 9.6583 57.7265 134.5849 46.6786 15.4931 4.9565 51.9425 9.8656 99.4600 315.7049 83.8118 14.1081 14.3954 5.5091 7.5415 29.7124 58.2222 51.1326 83.1573 124.6925 29.3842 4.4632 22.6435 21.3245 65.4867 28.3028 58.1662 4.0870 13.1507
temp: 298.150 k
press: 1.00000 atm
elementType: 8 8 8 8 8 7 6 6 6 6 6 6 6 6 6 6 6 6 6 6 6 6 6 1 1 1 1 1 1 1 1 1 1 1 1 1 1 1 1 1 1 1
symmnumber: 1
zpe: 881989.3 jmol-1
zpe.correction: 0.335932 hartree
zpe.thermalcorrener: 0.354434 hartree
zpe.thermalcorrenthalpy: 0.355378 hartree
zpe.thermalcorrgfe: 0.290180 hartree
zpe.sumelectzpe: -1088.344173 hartree
zpe.sumelectthermal: -1088.325671 hartree
zpe.sumelectthermalent: -1088.324727 hartree
zpe.sumelectthermalfe: -1088.389925 hartree
dipole: 0.6965 -5.1619 -1.5100
dipole: 5.4231
quadrupole: -123.0975 -151.1346 -129.9814
quadrupole: 6.3006 -2.2490 -5.3603
quadrupole: 11.6404 -16.3968 4.7564 6.3006 -2.2490 -5.3603
hfenergy: -1088.680105 hartree
pointgroup: C01 [X(C17H19N1O5)]
dipole: -0.3298801 -2.0344034 0.5519875 debye
polarizability: 258.4395961|-11.1824283|222.9729586|-4.8495915|-2.2582475|129.2814984 unknown
InChI: InChI=1S/C17H19NO5/c1-18-3-2-8-4-11(19)16-14(15(8)18)9-5-12-13(22-7-21-12)6-10(9)17(20)23-16/h5-6,8,11,14-16,19H,2-4,7H2,1H3
charge 0 multiplicity 1
42 atoms
O  -0.66697 2.696545 0.086636
O  -3.266656 2.176939 -0.746324
O  1.325712 3.688834 -0.446211
O  3.433031 -2.331232 0.153608
O  4.75445 -0.3241 0.143122
N  -1.64874 -2.273863 -0.373348
C  -1.794331 -0.940312 0.299306
C  -3.315887 -0.621343 0.201189
C  -0.939285 0.238655 -0.200219
C  -1.341942 1.478852 0.631973
C  -3.691371 0.602257 1.052689
C  -3.952098 -1.990598 0.546269
C  -2.845921 1.816149 0.615014
C  -2.82534 -3.037414 0.177588
C  0.575355 0.088725 -0.08449
C  -1.625544 -2.221276 -1.858349
C  1.359584 1.283269 -0.07445
C  1.20571 -1.183079 -0.012012
C  0.726802 2.629515 -0.164528
C  2.785806 1.241858 -0.011017
C  2.599715 -1.197105 0.064658
C  3.374864 -0.014143 0.060296
C  4.829669 -1.807591 0.186204
H  -1.546857 -1.111402 1.372966
H  -3.536231 -0.366472 -0.853707
H  -1.211436 0.455936 -1.254533
H  -1.004976 1.345131 1.681223
H  -4.758056 0.865895 0.937936
H  -3.511766 0.398313 2.127996
H  -4.885874 -2.168701 -0.013944
H  -4.193428 -2.05031 1.624706
H  -3.012753 2.674203 1.299368
H  -2.501504 -3.580352 1.084727
H  -3.162833 -3.784828 -0.560522
H  -1.58535 -3.253801 -2.245934
H  -0.70821 -1.707452 -2.196632
H  -2.501699 -1.71152 -2.323028
H  0.597705 -2.0950 -0.01234
H  -2.670991 2.911075 -1.050824
H  3.361179 2.170323 -0.024332
H  5.366119 -2.169709 -0.707463
H  5.304547 -2.119474 1.131629
