program: Gaussian 09
title: 000189306
version: EM64L-G09RevD.01
frameworkgroup: C1[X(C23H29NO4)]
method: RPBEPBE
basis: SDD
operation: Freq
keyword: #p
keyword: freq=noraman
keyword: PBEPBE/SDD
title: #p freq=noraman PBEPBE/SDD
converged: YES YES NO NO
title: Mulliken charges:
elementType: O O O O N C C C C C C C C C C C C C C C C C C C C C C C H H H H H H H H H H H H H H H H H H H H H H H H H H H H H
charge: -0.309198 -0.301658 -0.300462 -0.300530 -0.144325 -0.223824 0.182888 0.457083 0.340638 -0.508258 -0.397958 0.090871 -0.584671 -0.780318 -0.761034 0.356709 -0.433674 -0.576617 0.038546 -0.602901 -0.401550 0.185769 0.172220 0.195985 -0.528649 -0.528877 -0.531110 -0.529936 0.215130 0.256334 0.201318 0.194909 0.218747 0.218576 0.230118 0.212716 0.218082 0.257035 0.213813 0.242999 0.223331 0.229204 0.277606 0.259980 0.246704 0.257746 0.226852 0.218864 0.221632 0.251279 0.226610 0.228203 0.220827 0.252432 0.254002 0.227891 0.221899
chargesum: 0.00000
title: Mulliken charges with hydrogens summed into heavy atoms:
elementType: O O O O N C C C C C C C C C C C C C C C C C C C C C C C
charge: -0.309198 -0.301658 -0.300462 -0.300530 -0.144325 -0.008694 0.182888 0.457083 0.340638 -0.050606 0.015697 0.090871 -0.135977 -0.092485 -0.080891 0.356709 -0.204470 -0.299011 0.038546 -0.342921 -0.154845 0.185769 0.172220 0.195985 0.174813 0.170644 0.170354 0.173856
polarizability: 3.87752567e+02 -1.01863697e+01 2.42406658e+02 -4.77774308e+00 -1.01907571e+00 1.96376714e+02
1716.lowfreq: -11.8929 -2.3826 -0.0006 -0.0004 0.0008 6.6509 22.7295 38.6620 45.2859
frequency: 22.3530 38.6176 45.2599 54.7203 72.8038 76.3900 88.9574 102.9970 105.2122 108.0162 137.4070 147.7198 152.4818 157.8670 162.1864 166.7247 181.6740 190.8736 200.6564 215.4040 223.3359 234.6353 247.2165 261.3791 269.4157 275.4333 280.6018 288.0014 313.2775 329.8016 349.6834 350.8907 367.5713 377.7347 400.1939 417.8914 438.2286 451.5366 466.8913 498.5676 508.1448 512.2287 538.3560 553.0926 557.3334 600.3618 626.0607 655.0818 657.7314 698.1103 703.9699 717.6264 729.0416 746.2161 767.8084 781.3314 811.2031 825.0848 827.9196 864.6281 887.4898 901.5078 909.5957 917.1990 932.1159 936.5463 946.3071 957.7686 960.5564 966.8200 983.7377 998.7592 1009.3241 1023.3270 1056.4403 1078.6301 1107.9958 1112.2530 1113.4321 1114.6527 1115.2278 1136.4342 1145.2170 1146.5898 1150.0689 1153.3714 1155.5908 1158.4874 1167.8055 1172.7907 1181.9415 1191.3546 1199.3998 1213.7176 1223.5902 1235.9397 1249.4611 1256.2682 1266.8824 1273.9630 1298.5921 1312.9859 1316.2288 1349.0361 1363.8659 1368.1686 1371.2773 1380.4964 1390.8310 1394.8189 1411.0785 1422.8718 1424.5965 1440.1766 1441.5768 1444.3496 1453.9392 1456.0350 1456.5176 1458.2400 1459.2526 1461.1519 1465.1474 1472.9963 1477.4353 1478.0710 1482.1222 1486.9006 1487.7001 1488.4648 1488.7977 1496.3713 1565.7732 1576.1941 1601.3573 1617.6422 2802.0313 2813.8856 2853.1962 2968.0843 2968.2504 2970.1153 2971.2427 2975.7757 2982.0126 2983.9127 3021.2176 3032.7061 3046.2613 3063.8287 3063.8621 3066.8989 3067.4742 3068.3582 3078.6344 3091.0322 3091.9731 3116.6249 3117.1832 3117.9657 3119.2978 3138.4631 3140.8972 3157.2725 3163.2470
redmass: 4.3181 3.9241 4.2717 3.3203 3.3975 3.6731 3.4978 2.6832 2.7824 3.3194 2.9953 1.2694 1.2050 2.4648 1.1995 1.2425 1.9066 2.7924 3.1388 2.7326 2.0692 2.4371 2.2384 2.7296 1.5986 4.0141 3.7336 3.1130 2.8460 2.8411 3.4305 3.6611 4.4874 3.3911 3.8711 4.5930 4.2077 3.9627 5.0492 3.9938 3.7477 4.3488 4.1384 3.4244 4.5085 4.1953 4.9137 3.6577 4.8538 5.1700 4.9561 4.2922 4.6291 3.4062 4.9660 4.0311 4.2253 1.5760 2.9568 3.4254 1.5572 3.3249 2.0529 3.0532 1.4678 2.4255 1.4607 5.3679 2.8883 2.9224 2.8957 2.5182 1.3702 2.7198 2.0835 3.8767 2.0899 1.2491 1.2410 1.2493 1.2392 2.3825 1.8613 1.4964 1.5640 1.4110 1.4403 1.8341 2.3564 1.5507 2.5772 1.7439 1.9960 2.0247 1.3604 1.9644 1.5605 3.7482 1.8684 3.8117 1.5679 1.4779 1.6905 2.6684 5.2450 1.2289 3.0703 1.7287 1.4105 2.0169 2.0747 1.1769 1.2809 1.3948 1.1531 1.3415 1.2930 1.0605 1.0560 1.0889 1.0654 1.0539 1.1739 1.5381 1.0552 1.0647 1.2537 1.1510 1.0576 1.7478 1.0663 1.1719 8.3739 7.8469 7.4539 7.2452 1.0718 1.0803 1.0713 1.0308 1.0309 1.0311 1.0311 1.0349 1.0382 1.0611 1.0879 1.0850 1.1006 1.1037 1.1038 1.1036 1.1036 1.0997 1.0965 1.0989 1.0987 1.1025 1.1029 1.1026 1.1027 1.0869 1.0914 1.0911 1.0961
irintensity: 0.1259 0.5482 0.0831 0.4371 4.2662 4.7108 1.2917 2.0066 14.5274 0.0167 0.4424 0.0179 0.1528 1.7496 1.2726 0.4742 0.3957 8.3257 0.7589 10.8013 1.4830 9.7369 0.7187 3.2718 1.7180 4.9359 5.2241 5.9283 5.2891 0.0481 3.2680 1.2997 1.6012 2.9229 7.3865 2.1504 1.6438 2.4295 9.0430 1.7910 2.7020 2.1812 1.0519 0.4970 1.8406 9.8682 7.9002 13.0943 5.6147 4.5534 2.4102 0.9004 22.1515 6.7579 8.5476 5.3481 1.7311 29.5068 8.9934 7.1251 1.8678 10.4580 13.8285 57.2577 4.8106 15.0491 6.8189 126.3690 15.7598 62.5554 55.8216 9.5557 3.0902 52.6098 1.6431 45.7749 23.3580 12.6040 6.2754 5.5927 5.2396 12.6630 17.0400 5.0451 11.3637 2.6808 23.4083 6.0389 16.8157 69.8735 13.5298 25.2879 4.5232 13.5852 6.8541 21.7683 2.4074 121.4823 37.5345 139.4742 0.7491 13.0248 23.3548 19.7611 9.2459 22.5800 8.1608 50.9311 6.6019 28.0549 16.5110 0.0699 6.7008 26.3185 6.8290 14.9279 35.3029 16.8209 16.4338 2.4568 9.8723 3.3786 2.4337 65.0820 4.5214 4.1471 14.5763 50.7151 19.5737 119.8236 36.4631 21.8304 2.9675 4.7819 2.3465 6.6947 67.0486 65.6183 141.0908 85.4854 91.0280 76.8549 61.9236 27.0953 23.9344 24.0137 49.6822 18.5231 38.7371 21.6996 37.0035 26.0733 25.6506 38.4480 29.8834 32.1703 32.4562 29.4535 23.8976 25.2841 28.5206 9.4898 7.2991 2.5893 13.8161
temp: 298.150 k
press: 1.00000 atm
elementType: 8 8 8 8 7 6 6 6 6 6 6 6 6 6 6 6 6 6 6 6 6 6 6 6 6 6 6 6 1 1 1 1 1 1 1 1 1 1 1 1 1 1 1 1 1 1 1 1 1 1 1 1 1 1 1 1 1
symmnumber: 1
zpe: 1236778.8 jmol-1
zpe.correction: 0.471064 hartree
zpe.thermalcorrener: 0.499397 hartree
zpe.thermalcorrenthalpy: 0.500341 hartree
zpe.thermalcorrgfe: 0.413298 hartree
zpe.sumelectzpe: -1247.318432 hartree
zpe.sumelectthermal: -1247.290100 hartree
zpe.sumelectthermalent: -1247.289155 hartree
zpe.sumelectthermalfe: -1247.376199 hartree
dipole: 0.2741 0.9282 0.5583
dipole: 1.1173
quadrupole: -149.8445 -164.9375 -158.0926
quadrupole: -10.1690 0.6106 2.8720
quadrupole: 7.7804 -7.3127 -0.4677 -10.1690 0.6106 2.8720
hfenergy: -1247.7894965 hartree
pointgroup: C01 [X(C23H29N1O4)]
dipole: -0.1180743 -0.3580882 0.2259834 debye
polarizability: 387.0949128|-13.7562466|243.0323589|5.919149|-0.0503038|196.4086671 unknown
InChI: InChI=1S/C23H29NO4/c1-23(2)17-7-8-18(25-3)21(28-6)16(17)13-24-10-9-14-11-19(26-4)20(27-5)12-15(14)22(23)24/h7-8,11-12,22H,9-10,13H2,1-6H3
charge 0 multiplicity 1
57 atoms
O  4.478682 -1.502495 0.887218
O  6.168791 0.750092 0.146571
O  -4.823085 1.668565 1.255317
O  -6.064037 -0.432886 -0.382251
N  0.388699 -1.399652 -0.147709
C  -0.301219 -0.145896 0.243929
C  0.38717 1.031013 -0.577015
C  1.922741 0.919443 -0.373348
C  -1.822398 -0.243263 0.091401
C  1.710028 -1.495195 0.475792
C  -0.393106 -2.644668 -0.17358
C  2.528461 -0.254972 0.154393
C  -1.581071 -2.455189 -1.135288
C  -0.112482 2.412186 -0.072199
C  0.058328 0.88972 -2.088987
C  -2.43739 -1.307721 -0.628427
C  2.769783 2.004307 -0.726592
C  -2.659283 0.704657 0.732481
C  3.930993 -0.303038 0.358285
C  -3.843624 -1.331526 -0.777672
C  4.167402 1.939011 -0.565025
C  4.762061 0.779831 -0.027895
C  -4.060282 0.669601 0.598722
C  -4.662147 -0.33713 -0.208109
C  5.152579 -1.343218 2.196769
C  6.865436 -0.255894 -0.687986
C  -5.737034 1.150198 2.29969
C  -6.677484 0.725405 -1.072781
H  -0.096365 0.080797 1.324539
H  2.238274 -2.384824 0.088947
H  1.64978 -1.629301 1.589801
H  -0.775379 -2.951294 0.833559
H  0.272525 -3.451628 -0.534176
H  -2.182783 -3.380679 -1.199507
H  -1.17902 -2.243271 -2.145081
H  0.055846 2.532717 1.014982
H  0.409612 3.238126 -0.5841
H  -1.187764 2.536832 -0.280908
H  0.587394 1.663632 -2.674495
H  0.374286 -0.10272 -2.452692
H  -1.027485 1.005227 -2.264099
H  2.339287 2.917609 -1.148377
H  -2.238659 1.480153 1.379313
H  -4.329523 -2.137491 -1.338826
H  4.815952 2.772526 -0.852856
H  5.980781 -0.615619 2.125171
H  5.535469 -2.34294 2.453755
H  4.426452 -1.009193 2.962403
H  6.73268 -0.018196 -1.760807
H  6.486017 -1.272946 -0.480464
H  7.929411 -0.177544 -0.416187
H  -6.281262 2.029593 2.676969
H  -5.1544 0.688064 3.119514
H  -6.440665 0.40957 1.878209
H  -6.465467 1.66644 -0.533843
H  -7.759025 0.520762 -1.084037
H  -6.296575 0.793618 -2.10961
