program: Gaussian 09
title: 000189303
version: EM64L-G09RevD.01
frameworkgroup: C1[X(C8H11N3O)]
method: RPBEPBE
basis: SDD
operation: Freq
keyword: #p
keyword: freq=noraman
keyword: PBEPBE/SDD
title: #p freq=noraman PBEPBE/SDD
converged: NO YES NO NO
title: Mulliken charges:
elementType: O N N N C C C C C C C C H H H H H H H H H H H
charge: -0.253954 -0.173751 -0.040488 0.057945 0.470022 -0.400109 -0.409231 0.152886 -0.290499 -0.654846 -0.361433 -0.772275 0.227068 0.263647 0.241913 0.278606 0.245644 0.231691 0.226916 0.243866 0.227485 0.259931 0.228967
chargesum: 0.00000
title: Mulliken charges with hydrogens summed into heavy atoms:
elementType: O N N N C C C C C C C C
charge: -0.253954 -0.173751 -0.040488 0.057945 0.470022 0.090606 -0.167319 0.152886 -0.011893 0.049405 -0.117568 -0.055893
polarizability: 1.65628056e+02 7.47256796e+00 1.20216953e+02 2.26659456e+00 -5.51611962e+00 6.14038183e+01
1716.lowfreq: -33.6328 -12.3017 -4.9712 -0.0008 -0.0006 -0.0006 3.3243 33.1719 82.2978
frequency: -33.4817 32.9912 82.2706 103.9513 161.9753 196.4239 209.7889 238.5343 273.7507 296.3467 373.0147 395.0551 427.8585 446.4682 515.5198 546.3616 598.2987 670.7508 728.7268 733.4698 782.3791 826.8857 850.6193 876.1837 929.0739 958.4019 969.7617 976.0622 999.3292 1048.7773 1058.3923 1086.9129 1102.8700 1155.8483 1214.1192 1278.5234 1294.7156 1307.0064 1332.0671 1360.5737 1365.7769 1388.6728 1394.1840 1411.8283 1452.8036 1466.0794 1470.0220 1470.4033 1471.6241 1485.8481 1554.5393 1583.3744 2983.9765 2995.4931 3023.5571 3061.9584 3077.7884 3094.0241 3107.5611 3120.1443 3138.6657 3161.5400 3205.2629
redmass: 1.0226 4.3144 2.7583 5.6089 3.1616 3.3116 1.1592 4.0957 9.1510 4.1468 3.0116 4.8274 3.1593 3.1278 4.1171 5.0461 4.2893 4.9470 2.5293 3.0102 2.3149 2.7977 1.4157 1.3617 2.5930 3.9410 3.1745 1.3942 1.6844 1.5867 3.8524 1.8981 1.5518 1.7733 1.9269 2.1607 1.4399 2.4933 2.0450 2.1287 2.8818 1.2376 1.3398 2.9605 1.4194 1.1604 1.0742 1.0686 1.4497 1.0527 7.1077 5.7960 1.0383 1.0356 1.0593 1.0974 1.1020 1.0997 1.1022 1.0980 1.0911 1.0917 1.0949
irintensity: 0.3978 1.7490 0.0497 1.2543 3.3964 4.7362 0.5744 0.2830 1.3735 6.8408 1.6327 2.5475 8.1024 2.7830 1.8438 3.1289 1.8192 5.1662 0.7872 1.5414 100.1528 1.6147 47.3919 5.1905 143.4692 40.9143 16.3724 1.8429 13.0151 8.5178 55.3736 19.5038 2.9970 16.7258 1.7555 3.7253 7.5110 21.4408 9.6694 71.7668 140.3927 13.7332 10.9503 33.8339 14.9182 37.7499 13.3764 3.8755 53.8894 11.3153 43.7701 158.4651 18.1194 18.2100 17.7950 19.1345 1.9731 33.1648 17.3778 8.5770 24.0687 7.4332 0.9095
temp: 298.150 k
press: 1.00000 atm
elementType: 8 7 7 7 6 6 6 6 6 6 6 6 1 1 1 1 1 1 1 1 1 1 1
symmnumber: 1
zpe: 478058.8 jmol-1
zpe.correction: 0.182083 hartree
zpe.thermalcorrener: 0.193253 hartree
zpe.thermalcorrenthalpy: 0.194197 hartree
zpe.thermalcorrgfe: 0.144431 hartree
zpe.sumelectzpe: -549.967692 hartree
zpe.sumelectthermal: -549.956522 hartree
zpe.sumelectthermalent: -549.955578 hartree
zpe.sumelectthermalfe: -550.005343 hartree
dipole: 0.2968 3.5987 -0.5437
dipole: 3.6516
quadrupole: -86.8932 -64.7792 -71.5689
quadrupole: -4.0583 -0.1105 -1.1466
quadrupole: -12.4795 9.6346 2.8449 -4.0583 -0.1105 -1.1466
hfenergy: -550.1497747 hartree
pointgroup: C01 [X(C8H11N3O1)]
dipole: 0.1659473 -1.4004351 0.2742176 debye
dipolederiv: -1.4983882 0.426364 -0.2085571 -0.3182511 -0.1766876 -0.0353665 -0.0696295 0.0418314 -0.2060053 -1.1702192 0.0203002 -0.1243388 0.6689631 -0.4457358 0.0854449 -0.3266321 0.0339886 -0.1964505 -0.5000869 -0.0049688 -0.0288313 0.1196525 -0.5301738 0.0555071 -0.0297082 0.0484973 -0.2525651 1.5885067 -0.6752673 0.292217 -0.6554428 0.2457449 -0.1512712 0.3465423 -0.1325054 0.0073368 1.2517654 0.1752128 0.1070641 0.194813 0.2071237 0.0214587 0.0954595 0.0160229 0.1119247 0.0884243 0.1498513 -0.0022618 0.1618658 0.2895168 0.0372639 0.0373653 -0.0033704 0.243391 -0.6210446 0.1821734 -0.0800593 0.1610463 -0.0810752 0.0154131 -0.0691393 0.0067682 -0.1719586 0.6256773 -0.2824873 0.109632 -0.2725769 0.4463297 -0.0993321 0.0826121 -0.0995418 0.0366396 -0.3786851 -0.1896568 -0.0043756 -0.2221635 -0.2347622 -0.0064924 0.0252598 0.0029372 -0.1231873 0.0564787 -0.000907 0.0016509 -0.0164041 -0.0124627 -0.0205635 -0.0235015 -0.0084709 -0.0504415 0.3096925 0.1669221 0.008193 0.0255322 0.3720561 -0.0688282 0.0190568 -0.0601755 -0.0577927 -0.084799 0.1147723 -0.0316219 0.19352 -0.163703 0.0536223 -0.0468767 0.0510932 0.0449738 0.0770076 0.0368716 -0.1374099 0.0076939 -0.0058665 0.0221127 -0.0994457 0.014251 -0.0450908 -0.0371946 -0.0529182 0.0830635 0.0651725 0.077779 -0.0536829 -0.0018221 -0.0277732 0.0754856 0.1026806 -0.0591386 0.0085019 -0.0689015 -0.0742756 0.0214479 0.0182961 0.0299634 0.148294 0.0735783 0.0764207 -0.0157753 0.0452704 0.0631932 0.0207591 -0.0079044 0.0251674 0.1668928 0.0328998 0.0289455 -0.0920357 0.0835534 0.0657555 0.0710348 -0.054206 0.0169559 -0.0225523 -0.1011002 0.0393539 0.0911517 0.0183927 0.0940381 -0.0187442 0.0597132 -0.0092487 0.0510162 0.062577 -0.0884259 0.021253 -0.1011479 -0.1321792 0.0305023 0.0333047 0.0342807 0.0738927 0.066976 -0.0564638 0.002911 -0.0463536 -0.104795 0.0329102 0.0007259 0.0331572 0.1263286 0.064432 0.0046539 -0.04717 0.043505 -0.0294618 -0.099504 0.0040686 -0.1270514 -0.0039533 -0.0674213 -0.0201131 -0.0091624 -0.1193072 0.0811711 -0.0010907 0.0100392 0.0048626 0.1195513 0.0582428 0.0085051 0.0559606 0.0315682 0.0484705 0.0873987 -0.0035779 0.1083599 -0.0757296 unknown
polarizability: 164.8717019|-3.7044869|119.1653782|12.53791|-7.6606428|63.2117467 unknown
InChI: InChI=1S/C8H11N3O/c1-3-11(10-12)8-4-5-9-7(2)6-8/h4-6H,3H2,1-2H3
charge 0 multiplicity 1
23 atoms
O  -3.502877 0.725257 -0.525018
N  -1.411934 -0.018037 -0.093214
N  2.763246 0.913013 0.091974
N  -2.267052 1.046152 -0.46086
C  -0.021659 0.297344 -0.037877
C  -1.961904 -1.367898 0.178903
C  0.942553 -0.712474 0.201671
C  2.31957 -0.370463 0.262809
C  0.434712 1.633666 -0.217954
C  -1.955545 -2.277861 -1.068796
C  1.817115 1.874912 -0.144139
C  3.369229 -1.432312 0.522607
H  -1.392527 -1.812637 1.01217
H  -3.00196 -1.207979 0.514073
H  0.654999 -1.758603 0.337826
H  -0.267977 2.446138 -0.404772
H  -2.578992 -1.842025 -1.867627
H  -0.935387 -2.425135 -1.46407
H  -2.373042 -3.266835 -0.808447
H  2.201121 2.892673 -0.276651
H  3.334238 -2.229911 -0.242805
H  4.367017 -0.968264 0.505229
H  3.219853 -1.913722 1.507269
