program: Gaussian 09
title: 000189302
version: EM64L-G09RevD.01
frameworkgroup: C1[X(C5H12N2O2)]
method: RPBEPBE
basis: SDD
operation: Freq
keyword: #p
keyword: freq=noraman
keyword: PBEPBE/SDD
title: #p freq=noraman PBEPBE/SDD
converged: YES YES NO NO
title: Mulliken charges:
elementType: O O N N C C C C C H H H H H H H H H H H H
charge: -0.431188 -0.281312 -0.061153 0.039493 -0.364269 -0.339653 -0.381016 -0.301337 -0.671704 0.210230 0.246342 0.241003 0.197692 0.235467 0.234852 0.209367 0.222222 0.206857 0.220270 0.226615 0.341222
chargesum: 0.00000
title: Mulliken charges with hydrogens summed into heavy atoms:
elementType: O O N N C C C C C
charge: -0.089966 -0.281312 -0.061153 0.039493 0.092304 0.099042 0.089302 0.130252 -0.017963
polarizability: 9.25598617e+01 -3.88625699e+00 8.25322470e+01 3.18337865e+00 -5.53099161e+00 5.93798827e+01
1716.lowfreq: -10.3459 -6.8764 -0.0010 -0.0009 -0.0009 10.5923 56.1432 69.5648 86.6634
frequency: 56.0078 69.5308 86.5977 99.6483 110.2370 214.7334 230.9794 278.9424 296.0213 320.3136 330.3696 383.5240 404.1684 486.2354 681.5302 748.3866 796.9783 829.2897 870.1610 906.6718 963.0247 992.4452 1035.9802 1048.9632 1058.9103 1105.0871 1110.3955 1207.2590 1237.2988 1272.8929 1287.4061 1298.0456 1310.2907 1330.5999 1338.3301 1353.5637 1363.1864 1380.7280 1396.3323 1437.8294 1454.2875 1475.2463 1479.0962 1481.0487 1485.9812 2977.8970 2978.6855 2990.3608 3000.1950 3002.6492 3046.6840 3062.0275 3065.0719 3082.9365 3084.9507 3091.9792 3565.4464
redmass: 3.2166 3.5706 2.0202 1.9465 4.9904 3.3328 1.1540 2.9534 2.7007 2.4313 1.7580 3.0734 4.7864 5.5361 2.6972 1.3119 1.1710 2.8818 1.4267 2.3267 3.3813 3.5079 4.0467 3.0102 1.4786 2.1402 1.4055 1.8212 2.4303 1.3043 1.3233 1.2890 1.2940 3.2264 1.3396 1.3088 1.4935 1.2744 1.2072 1.0978 1.0815 1.0585 1.0789 1.0429 1.0766 1.0620 1.0406 1.0596 1.0598 1.0599 1.0983 1.1012 1.1021 1.0995 1.1026 1.1017 1.0664
irintensity: 6.0944 2.5375 3.7245 1.9171 7.7975 0.0294 0.1388 2.1340 6.6030 80.7341 93.8807 1.8125 1.3236 7.3077 1.7943 14.6096 14.2016 12.6711 10.8820 17.9974 38.4557 176.4562 4.0149 0.8908 50.1355 4.0927 22.4180 3.1820 24.5548 2.2687 19.2357 2.0163 10.5661 119.8998 0.1011 2.0298 3.0049 10.8685 10.7846 11.9028 12.4675 3.0707 5.5952 11.3821 18.0538 32.2281 29.7002 4.9859 31.7388 61.6466 1.9548 3.0739 1.2065 43.3525 48.6267 40.8010 10.4902
temp: 298.150 k
press: 1.00000 atm
elementType: 8 8 7 7 6 6 6 6 6 1 1 1 1 1 1 1 1 1 1 1 1
symmnumber: 1
zpe: 460881.9 jmol-1
zpe.correction: 0.175541 hartree
zpe.thermalcorrener: 0.186631 hartree
zpe.thermalcorrenthalpy: 0.187576 hartree
zpe.thermalcorrgfe: 0.138130 hartree
zpe.sumelectzpe: -456.851952 hartree
zpe.sumelectthermal: -456.840861 hartree
zpe.sumelectthermalent: -456.839917 hartree
zpe.sumelectthermalfe: -456.889363 hartree
dipole: 1.0476 -2.2694 0.8125
dipole: 2.6283
quadrupole: -54.6077 -67.2801 -53.7760
quadrupole: 12.2234 -2.9445 2.3323
quadrupole: 3.9469 -8.7255 4.7786 12.2234 -2.9445 2.3323
hfenergy: -457.0274928 hartree
pointgroup: C01 [X(C5H12N2O2)]
dipole: -0.2288643 1.00476 0.0857015 debye
dipolederiv: -0.7924865 0.3663487 -0.0571844 0.3389422 -0.3128604 0.1157872 -0.0658147 0.1163058 -0.5919048 -0.6388641 0.8439789 0.0311199 0.1093815 -0.7470949 -0.0235211 0.014142 -0.0214069 -0.2060277 -0.2556177 -0.0296694 0.0225226 0.3353656 -0.8982012 0.0068276 0.0681665 -0.0209026 -0.2796061 0.1552963 -0.6991847 -0.0367114 -0.430356 1.2906283 0.1146127 -0.0884019 0.1608496 -0.0898176 0.2099568 0.0554622 0.0202733 0.0829185 0.1483465 -0.0033021 0.0033512 0.0509199 0.2398434 0.0819152 -0.0430301 -0.0260382 -0.0703163 0.0611925 -0.0437577 0.0093005 -0.1077825 0.0358831 0.3759731 -0.1946656 -0.0129473 -0.0864988 0.104719 0.0312802 -0.0597349 0.0637421 0.1806057 0.6504229 -0.1767921 0.0506007 -0.1774685 0.3514195 -0.0115295 0.1057537 -0.0718929 0.3418043 -0.0213872 -0.0701341 -0.0079004 -0.0510985 0.071284 0.0090686 0.0330865 0.0577306 0.0558961 0.0431033 0.0103152 0.0682188 0.0199439 -0.0616148 -0.1074741 0.0549827 -0.081043 0.0217878 -0.004639 -0.0035041 -0.0678074 0.0680912 0.028809 0.1037721 -0.0331527 0.0187521 0.0181814 0.0571135 -0.0056793 0.0206449 0.0247681 -0.0466392 -0.1091349 0.0005237 -0.0576089 0.0171371 -0.0617738 0.0698756 -0.0913445 0.0713312 -0.0025107 0.1015603 -0.0786405 0.0780273 -0.0301779 0.0391703 0.0456236 -0.0221792 0.0663394 0.0076109 -0.09297 0.0118045 -0.0741184 -0.0808823 -0.0543419 -0.0450387 0.0086122 -0.1270892 0.0104029 0.0291643 -0.0380947 0.0070761 0.0932843 0.0044766 0.0418867 0.0226319 0.0796196 -0.0289092 -0.1165588 0.0234237 -0.0655929 -0.124091 -0.0547129 -0.0834269 0.0165498 -0.1236368 -0.0269842 0.0209762 -0.0070416 0.0031605 0.0633998 0.0555913 0.064909 0.0358263 0.0036379 -0.0946578 -0.1162855 -0.0068493 -0.1340667 0.0174545 -0.0018106 0.0472693 -0.0761903 0.0968107 -0.0073756 0.0924319 -0.1171074 0.0660384 0.0087973 -0.0210952 -0.0718054 0.0983199 -0.0637609 0.0672127 0.0449256 0.1308121 0.0596694 -0.0742892 0.2337098 -0.1227388 0.0029829 -0.1669246 0.0852227 -0.0458729 0.0394906 -0.0478569 0.3827219 unknown
polarizability: 90.6495832|-5.8427832|85.8365953|0.4554377|-0.3272476|57.9858129 unknown
InChI: InChI=1S/C5H12N2O2/c1-2-3-7(6-9)4-5-8/h8H,2-5H2,1H3
charge 0 multiplicity 1
21 atoms
O  -3.040107 1.777739 -0.586407
O  0.961302 -2.381652 0.244323
N  -0.1687 -0.454723 0.508126
N  -0.199022 -1.819905 0.257679
C  1.099183 0.263589 0.772528
C  1.898525 0.6246 -0.504967
C  -1.483845 0.203013 0.532629
C  -1.74144 1.106493 -0.699628
C  3.22266 1.33009 -0.143127
H  0.853668 1.17443 1.348583
H  1.721835 -0.400617 1.402834
H  2.104478 -0.303951 -1.066929
H  1.288479 1.278131 -1.157786
H  -1.584781 0.81472 1.448643
H  -2.235817 -0.606714 0.569443
H  -1.660148 0.507721 -1.630567
H  -1.010797 1.93061 -0.745127
H  3.041667 2.262611 0.424498
H  3.864252 0.675119 0.474871
H  3.790048 1.593921 -1.053202
H  -3.766943 1.111874 -0.683116
