program: Gaussian 09
title: 000189301
version: EM64L-G09RevD.01
frameworkgroup: C1[X(C6H14N2O)]
method: RPBEPBE
basis: SDD
operation: Freq
keyword: #p
keyword: freq=noraman
keyword: PBEPBE/SDD
title: #p freq=noraman PBEPBE/SDD
converged: YES YES NO NO
title: Mulliken charges:
elementType: O N N C C C C C C H H H H H H H H H H H H H H
charge: -0.296761 -0.108000 0.051437 0.333198 -0.358392 -0.728537 -0.708792 -0.715963 -0.641691 0.221860 0.200236 0.236964 0.235030 0.202531 0.232711 0.207628 0.226339 0.228389 0.222184 0.222603 0.260077 0.261388 0.215561
chargesum: 0.00000
title: Mulliken charges with hydrogens summed into heavy atoms:
elementType: O N N C C C C C C
charge: -0.296761 -0.108000 0.051437 0.333198 0.063704 -0.054011 -0.042114 -0.042787 0.095336
polarizability: 1.05278598e+02 -2.62945771e+00 8.02874801e+01 4.07268084e+00 -1.30009554e+00 7.00546852e+01
1716.lowfreq: -17.5164 -15.9369 -7.6876 -0.0002 0.0007 0.0008 46.4662 66.3323 73.4653
frequency: 46.3848 65.7134 73.1263 155.7230 197.3689 231.1941 260.8789 268.8152 284.3761 311.7791 340.9853 360.8777 380.2219 398.6813 452.9680 467.0639 611.3329 753.6518 777.2805 805.9909 909.1940 928.4921 950.8841 983.3773 1028.0578 1037.4751 1062.5422 1098.7743 1130.9827 1153.9405 1214.6496 1234.5000 1244.2331 1298.1939 1324.5665 1331.8812 1378.6045 1389.8238 1403.0960 1421.6531 1442.1341 1458.3783 1460.2188 1462.2384 1471.9813 1483.7924 1485.9705 1488.5853 1491.1438 2979.2007 2987.8245 2989.7714 2995.7907 3006.0581 3034.5646 3069.6835 3077.9372 3085.3335 3086.9371 3094.3402 3103.0522 3113.0386 3139.2891
redmass: 3.9250 1.3849 1.7147 1.7129 1.1514 2.5035 1.3034 1.5410 1.8972 2.4458 2.5839 2.9076 3.7287 3.7459 3.4660 3.0507 2.9459 3.0807 1.1900 3.3718 1.8650 1.5413 2.2040 1.2473 1.9740 1.6257 1.8522 1.3607 3.1658 2.1626 2.4115 2.6721 3.4720 1.8817 4.2941 1.4164 1.2100 1.2127 1.1987 1.1711 1.0440 1.0638 1.0498 1.0509 1.0544 1.0525 1.0662 1.0522 1.0538 1.0586 1.0358 1.0361 1.0353 1.0361 1.1013 1.0997 1.0988 1.0998 1.1004 1.0996 1.0990 1.0999 1.0994
irintensity: 3.8910 0.0392 0.3158 0.4981 0.2810 3.1702 0.1774 1.3595 3.1488 0.4731 1.0159 0.2771 1.5985 2.2878 3.6144 1.2074 3.3469 3.5362 5.1890 13.3748 9.6904 15.7723 68.2311 1.0345 12.9870 3.7608 4.3482 0.4652 109.4553 5.8937 15.1748 49.3700 8.4900 49.8544 50.3916 2.1197 18.9077 14.0261 28.7741 19.8989 12.0148 0.3276 5.2143 3.4540 26.2563 20.2987 8.7121 11.7172 6.4037 31.8044 19.4587 19.6676 22.5301 13.5797 11.8912 12.5402 38.2001 21.4298 55.9942 12.2955 46.9682 23.5098 12.7809
temp: 298.150 k
press: 1.00000 atm
elementType: 8 7 7 6 6 6 6 6 6 1 1 1 1 1 1 1 1 1 1 1 1 1 1
symmnumber: 1
zpe: 519039.3 jmol-1
zpe.correction: 0.197692 hartree
zpe.thermalcorrener: 0.209227 hartree
zpe.thermalcorrenthalpy: 0.210171 hartree
zpe.thermalcorrgfe: 0.160739 hartree
zpe.sumelectzpe: -420.946197 hartree
zpe.sumelectthermal: -420.934662 hartree
zpe.sumelectthermalent: -420.933718 hartree
zpe.sumelectthermalfe: -420.983150 hartree
dipole: 4.3503 -2.2635 0.9907
dipole: 5.0029
quadrupole: -68.2790 -55.1284 -55.1998
quadrupole: 5.0113 -2.8787 0.7140
quadrupole: -8.7432 4.4073 4.3359 5.0113 -2.8787 0.7140
hfenergy: -421.143889 hartree
pointgroup: C01 [X(C6H14N2O1)]
dipole: 1.7997742 -0.7968125 -0.0119766 debye
dipolederiv: -1.2017732 0.3247546 -0.044837 -0.3230315 -0.2250314 -0.0574002 -0.3130447 0.0596788 -0.2520446 -0.8256728 0.1219096 -0.0500319 0.4936877 -0.3191173 0.0619115 0.0699627 0.0189032 -0.2624576 1.3530914 -0.5151458 0.0637186 -0.4329841 0.106128 -0.0065174 0.1368924 -0.0274296 -0.0699485 0.6166846 0.0885948 0.0865664 0.1761993 0.1848346 -0.0375812 0.1230546 -0.0644377 0.3393179 -0.0183127 -0.0165774 -0.0390682 -0.0221822 0.1058776 -0.0069849 -0.0623542 0.0094959 0.0247947 0.0416013 0.0103119 0.0197396 -0.0293636 -0.0877699 -0.0512662 0.0079667 -0.0463179 -0.0203381 -0.087589 0.007503 -0.0311276 -0.0100603 -0.0092711 0.0755557 -0.0373944 0.0726142 -0.0531578 -0.0774409 -0.0318926 0.0049057 -0.0275526 0.0815715 -0.0082602 0.0978477 -0.0011698 0.0380738 0.0982889 -0.0098394 -0.020293 0.058503 0.1026865 -0.0194843 0.0201376 -0.0350746 0.1817367 -0.0102649 0.0637728 -0.0575544 0.0542611 -0.0134984 0.1159236 -0.0444941 0.080882 -0.0345889 0.0441603 -0.0374794 0.0014928 -0.0401884 -0.1381902 -0.1203933 -0.0121606 -0.0797836 0.0095809 0.0897542 0.0530482 -0.0341321 0.0300304 -0.0232108 0.0747399 -0.0473804 0.1076549 -0.0086313 0.0239611 0.0216837 0.1202948 -0.0120489 0.0780909 0.0067073 0.1033002 -0.0127791 -0.0537428 -0.1498395 -0.0772499 -0.0873627 -0.0355726 0.0731428 -0.0035944 -0.0766449 -0.0130294 0.0883081 0.0158544 -0.0140506 0.1364937 0.0070703 0.080837 0.0069426 0.1022606 0.0318082 -0.0623556 0.1093355 0.0175741 0.0013973 0.0229827 -0.1400704 -0.0568175 0.0121363 -0.1118176 0.0329823 -0.1286192 -0.0411932 -0.0862496 -0.0620227 0.0610268 -0.0279127 -0.0919253 -0.0103391 0.0867404 0.0706015 -0.0082903 -0.0202184 -0.0513831 -0.112758 -0.0806422 -0.0591131 -0.100258 0.0604126 0.0327311 0.0474528 -0.066853 0.0768154 -0.0273753 0.0968048 -0.1170903 0.0979316 0.0026345 -0.0275572 -0.0072999 0.1016622 -0.0043099 0.0983207 -0.0106094 0.1469763 0.0001562 -0.1116772 0.0665017 -0.0183365 -0.075896 0.0351657 0.0469142 0.0454362 -0.0369779 -0.0337946 -0.0737028 0.0022532 -0.1025926 0.0646964 -0.0065571 0.0244452 0.0088234 0.0759239 0.0589769 0.0207433 -0.0377499 0.1233422 0.0126563 0.1025416 0.052417 -0.005381 0.002121 -0.0018711 0.1173197 unknown
polarizability: 105.8286914|-1.4465415|78.9676455|2.3290671|3.2379947|70.8244264 unknown
InChI: InChI=1S/C6H14N2O/c1-5-6(2,3)8(4)7-9/h5H2,1-4H3
charge 0 multiplicity 1
23 atoms
O  -2.984564 0.192091 -0.262006
N  -0.825893 -0.348053 -0.033274
N  -1.815211 0.601681 0.112359
C  0.586587 0.037095 0.337288
C  1.432432 0.025586 -0.981075
C  0.583546 1.448973 0.970956
C  1.119864 -0.986466 1.376382
C  2.931942 0.352564 -0.809999
C  -1.176021 -1.671124 -0.590521
H  0.973168 0.753807 -1.677642
H  1.340887 -0.970229 -1.458326
H  0.233328 2.215625 0.261388
H  -0.073002 1.489236 1.855387
H  1.611568 1.696493 1.287362
H  0.446762 -1.026694 2.250815
H  1.211829 -2.005158 0.958657
H  2.11857 -0.678081 1.729828
H  3.088938 1.363165 -0.393739
H  3.439716 -0.373662 -0.150203
H  3.438913 0.31735 -1.791371
H  -1.602054 -1.557581 -1.60386
H  -1.952457 -2.148368 0.033597
H  -0.281148 -2.307154 -0.627801
