program: Gaussian 09
title: 000189299
version: EM64L-G09RevD.01
frameworkgroup: C1[X(C12H12N4O)]
method: RPBEPBE
basis: SDD
operation: Freq
keyword: #p
keyword: freq=noraman
keyword: PBEPBE/SDD
title: #p freq=noraman PBEPBE/SDD
converged: YES YES NO NO
title: Mulliken charges:
elementType: O N N N N C C C C C C C C C C C C H H H H H H H H H H H H
charge: -0.228896 -0.239024 -0.074034 -0.297076 -0.022136 0.312385 -0.146244 0.379458 0.163007 -0.086319 -0.360956 -0.326855 -0.646454 -0.330932 -0.185829 -0.377320 -0.489039 0.229708 0.257659 0.227556 0.251172 0.253716 0.272905 0.299281 0.225831 0.235975 0.216702 0.221138 0.264621
chargesum: 0.00000
title: Mulliken charges with hydrogens summed into heavy atoms:
elementType: O N N N N C C C C C C C C C C C C
charge: -0.228896 -0.239024 -0.074034 0.002205 -0.022136 0.312385 -0.146244 0.379458 0.163007 -0.086319 -0.131249 -0.069196 0.085990 -0.058027 0.040003 -0.141345 0.213422
polarizability: 2.59829235e+02 1.28154348e+01 1.89706437e+02 2.19725466e+00 1.05128627e+00 7.36512261e+01
1716.lowfreq: -3.5408 -0.0004 -0.0002 0.0008 8.9349 11.4132 19.3324 69.1502 80.6397
frequency: 18.7598 69.1153 80.6237 84.6464 95.5169 140.0280 175.7226 193.6915 205.3967 241.0365 268.0190 296.7760 323.0002 366.2851 421.7115 427.8965 436.7567 507.6665 521.3506 531.1849 558.1943 571.5686 631.8135 649.8446 674.6358 701.7805 716.2861 773.7021 781.3221 822.4376 836.2357 851.0902 866.1563 888.4062 939.9082 952.9718 979.2272 991.4705 1004.4160 1023.9093 1054.5621 1115.4891 1116.5429 1128.0331 1144.8805 1149.3448 1166.7773 1207.3711 1233.4482 1253.8388 1291.3567 1342.0536 1350.3402 1375.3696 1398.2343 1409.1226 1421.2174 1435.7062 1437.8768 1446.4484 1460.0217 1476.9081 1483.3154 1485.3242 1508.1510 1524.5935 1570.5349 1585.3192 1624.7293 2977.5794 2981.4252 3057.4692 3093.0607 3102.1460 3118.7952 3118.8455 3136.3541 3146.3310 3168.2039 3172.9666 3483.9795
redmass: 2.7766 1.3722 3.1636 4.2233 2.7635 3.0878 4.0287 1.7832 2.5777 2.7447 4.5143 5.6035 5.1069 6.5003 2.7008 2.9562 5.8926 5.2495 4.3593 3.2585 4.5791 3.1992 5.7889 4.8569 7.6562 4.8140 3.9416 6.8896 1.7567 1.4807 3.6490 4.2730 4.9293 5.3267 1.4185 1.3356 3.8216 1.3590 5.5060 2.6297 2.9333 1.2657 1.3064 1.2846 1.5809 1.6569 1.8041 2.3168 2.2420 2.8809 3.2243 3.8259 3.8145 2.2926 2.4962 1.1337 2.8324 1.0569 1.3169 3.5769 1.6541 1.1193 1.0874 1.0629 5.1494 6.0020 6.1823 7.6019 8.2708 1.0356 1.0284 1.1022 1.1047 1.0983 1.1009 1.0930 1.0893 1.0896 1.0999 1.0954 1.0766
irintensity: 1.1335 0.2408 2.5734 3.6905 3.4914 4.0662 10.7265 5.4602 1.4776 0.5060 3.6917 1.2760 1.1900 0.5202 21.4861 8.4030 11.1918 2.4219 4.6060 218.2163 17.0355 9.1169 3.9879 22.1352 15.0146 3.8331 8.6806 3.1253 2.1888 101.1150 0.0753 24.1297 6.0122 5.4363 0.0590 0.9477 30.4706 1.2512 18.8389 1.9187 22.9352 4.9149 5.6382 4.7682 4.9572 3.6099 9.4550 14.4775 2.2740 18.7849 19.5495 4.5745 45.4581 91.2262 2.4855 4.9357 2.6526 17.6725 13.0212 46.6667 38.1562 21.9616 12.2966 19.5349 21.9530 236.2079 26.9744 31.8999 4.7404 66.3569 68.7136 23.5688 26.7793 9.0354 28.7317 13.7771 10.5227 11.6504 26.3152 7.9702 12.2247
temp: 298.150 k
press: 1.00000 atm
elementType: 8 7 7 7 7 6 6 6 6 6 6 6 6 6 6 6 6 1 1 1 1 1 1 1 1 1 1 1 1
symmnumber: 1
zpe: 588410.9 jmol-1
zpe.correction: 0.224114 hartree
zpe.thermalcorrener: 0.238941 hartree
zpe.thermalcorrenthalpy: 0.239885 hartree
zpe.thermalcorrgfe: 0.181072 hartree
zpe.sumelectzpe: -757.445135 hartree
zpe.sumelectthermal: -757.430308 hartree
zpe.sumelectthermalent: -757.429363 hartree
zpe.sumelectthermalfe: -757.488176 hartree
dipole: 4.6761 1.9957 0.6339
dipole: 5.1235
quadrupole: -95.2131 -78.4240 -104.3913
quadrupole: 13.2000 2.6188 -1.8769
quadrupole: -2.5370 14.2522 -11.7151 13.2000 2.6188 -1.8769
hfenergy: -757.6692485 hartree
pointgroup: C01 [X(C12H12N4O1)]
dipole: -1.78584 0.925215 -0.134254 debye
polarizability: 257.0546133|-17.9802982|192.0697335|-9.0267515|0.9845717|74.0625513 unknown
InChI: InChI=1S/C12H12N4O/c1-16-10-6-5-9-8(4-3-7-13-9)11(10)14-12(16)15-17-2/h3-7,15H,1-2H3
charge 0 multiplicity 1
29 atoms
O  -4.204243 -0.953319 0.84767
N  -1.730117 1.655656 0.118741
N  -1.406458 -0.622425 0.045543
N  -3.704403 0.200745 0.079989
N  3.583803 -0.035822 -0.189224
C  -0.336772 1.450381 0.028263
C  -0.164547 0.038022 0.005761
C  1.149906 -0.521208 -0.063421
C  -2.312887 0.371437 0.117451
C  2.267152 0.405377 -0.11866
C  0.750366 2.362779 -0.03371
C  2.039708 1.826811 -0.103284
C  -2.421043 2.944538 0.170177
C  1.428177 -1.921498 -0.08168
C  2.75791 -2.347474 -0.151708
C  3.799895 -1.367188 -0.203974
C  -4.277405 -2.130473 -0.049645
H  0.59797 3.447487 -0.028596
H  2.923294 2.46977 -0.149965
H  -3.257268 2.910764 0.892937
H  -1.719739 3.719585 0.518006
H  -2.812689 3.242359 -0.820157
H  0.594284 -2.629132 -0.038448
H  -4.276621 1.007783 0.355175
H  3.014214 -3.41158 -0.166757
H  4.849057 -1.683098 -0.259577
H  -4.913506 -1.912853 -0.926718
H  -4.734165 -2.911785 0.580014
H  -3.261671 -2.42264 -0.364102
