program: Gaussian 09
title: 000189296
version: EM64L-G09RevD.01
frameworkgroup: C1[X(C20H18O2)]
method: RPBEPBE
basis: SDD
operation: Freq
keyword: #pfreq=noraman
keyword: PBEPBE/SDD
title: #p freq=noraman PBEPBE/SDD
converged: YES YES NO NO
title: Mulliken charges:
elementType: O O C C C C C C C C C C C C C C C C C C C C H H H H H H H H H H H H H H H H H H
charge: -0.442283 -0.442338 0.026704 -0.272142 0.181325 0.433770 0.285034 0.299899 -0.137091 -0.775179 -0.588582 0.121884 -0.403363 -0.247682 -0.441385 0.446156 -0.534235 -0.701130 -0.342758 -0.443037 -0.262486 -0.250061 0.271978 0.200518 0.230239 0.205338 0.298218 0.244758 0.255793 0.246141 0.234035 0.223515 0.220333 0.235761 0.339791 0.222858 0.358668 0.242694 0.228249 0.230088
chargesum: 0.00000
title: Mulliken charges with hydrogens summed into heavy atoms:
elementType: O O C C C C C C C C C C C C C C C C C C C C
charge: -0.102492 -0.083670 0.026704 -0.000164 0.181325 0.433770 0.285034 0.299899 0.063427 -0.544940 -0.085025 0.121884 -0.158604 0.008112 -0.195244 0.446156 -0.300200 -0.021520 -0.119900 -0.200343 -0.034236 -0.019973
polarizability: 3.95283379e+02 4.07155750e+00 2.41384301e+02 -3.92361226e+00 -1.12140163e+01 1.10934453e+02
1716.lowfreq: -8.3734 -4.8969 0.0007 0.0008 0.0009 4.1179 42.6689 44.2249 68.6633
frequency: 42.6253 44.2178 68.6553 88.6310 93.7442 144.4119 154.9786 168.7110 199.8591 229.3288 238.4276 254.6891 296.1807 308.0879 322.3130 346.9128 354.7860 363.4453 396.1393 425.3575 450.6230 457.1772 473.6148 498.9603 508.9884 523.2749 532.0395 541.0534 553.5955 573.9717 627.4275 630.8761 642.0496 685.0949 728.5340 747.9170 756.6181 764.6281 783.3429 805.3913 808.6559 838.0563 847.7468 870.0727 886.5409 893.4285 913.8202 921.6421 956.1689 965.0530 971.1883 975.2479 979.5583 991.9895 1018.7623 1037.5373 1045.3192 1061.0174 1068.0635 1095.5539 1114.6404 1158.2900 1166.5576 1175.1973 1178.4871 1194.6814 1221.7691 1235.5042 1236.7299 1242.2348 1251.7226 1255.9042 1275.3465 1313.0154 1314.8424 1325.6806 1345.8742 1352.9319 1368.9071 1386.4118 1389.2019 1405.0220 1411.9807 1432.6094 1446.4568 1447.1994 1470.7907 1485.9526 1489.2640 1512.6401 1527.0710 1567.6434 1599.1076 1613.8778 1625.9551 1652.8737 2855.4985 2979.6264 3000.1646 3019.2562 3072.1360 3076.4742 3103.2518 3121.6887 3122.0630 3125.1340 3133.0814 3142.0854 3152.6579 3166.1816 3167.6436 3168.8577 3527.1678 3532.4479
redmass: 4.2266 5.5347 4.3765 3.2671 3.7134 5.2935 3.9411 4.1422 1.0983 4.8399 3.8829 3.9284 3.8438 4.7701 3.8967 3.3037 2.4309 1.6182 3.2570 2.9832 4.9890 5.3463 3.8901 1.1694 3.8703 5.3879 3.4997 4.5309 3.7435 3.2682 3.5975 4.5948 4.6263 4.3806 2.1596 4.0924 1.8747 2.2485 1.5656 2.5860 1.8043 1.9204 2.1443 4.5044 1.7589 3.2884 2.2634 3.9370 1.3874 2.0120 3.3124 1.7367 1.4630 1.3626 2.9686 2.3164 3.4224 2.1975 2.1976 1.9586 2.1748 1.4626 1.2490 1.2690 1.1266 2.0660 1.4351 1.8115 1.5016 1.3252 1.3949 1.5026 1.7684 1.2788 2.8032 1.4484 1.7173 1.2079 2.8006 1.3768 2.6144 3.9197 2.0636 2.8893 3.2886 3.8589 1.0426 1.0506 3.6221 3.6425 1.1222 7.6848 6.3229 6.4357 6.5077 7.6352 1.0796 1.0349 1.0687 1.0837 1.0975 1.1002 1.0947 1.0870 1.0882 1.0884 1.0885 1.0915 1.0926 1.0991 1.0980 1.0939 1.0649 1.0656
irintensity: 0.4527 0.7488 0.2993 1.2455 1.7876 0.2738 1.5075 1.5232 0.0821 3.3265 1.2848 4.0601 4.1775 5.2944 0.2817 2.3450 28.3745 31.6290 9.7281 5.4343 0.8190 5.5163 1.2818 238.6353 12.5183 2.0525 8.1863 1.2636 4.6381 13.1675 3.8825 8.0876 9.2140 3.9064 3.3410 0.8033 13.7739 37.8425 13.6149 41.8290 1.2306 8.8352 48.0667 1.0117 1.2735 5.8340 25.2481 60.8499 1.7827 11.6587 16.4749 16.9654 4.8032 0.4164 42.6516 3.0483 92.2641 27.2866 3.4219 5.2363 7.6887 3.9522 4.8813 35.8324 3.6470 8.1833 47.4089 5.8333 39.9581 13.3920 9.6335 5.0517 3.7762 0.8945 5.5806 1.2726 4.8336 57.6205 2.8375 9.5613 3.9410 2.2740 6.4890 3.6583 5.2647 2.0089 10.4932 1.9655 2.3533 17.8642 14.6292 2.5625 16.8371 0.9566 0.2415 2.9805 55.7003 37.1840 27.2036 10.3416 25.2334 45.3653 10.6845 2.6078 6.9810 8.0177 11.2964 2.9875 33.7500 37.5448 15.6040 15.7750 12.5604 4.4208
temp: 298.150 k
press: 1.00000 atm
elementType: 8 8 6 6 6 6 6 6 6 6 6 6 6 6 6 6 6 6 6 6 6 6 1 1 1 1 1 1 1 1 1 1 1 1 1 1 1 1 1 1
symmnumber: 1
zpe: 847134.9 jmol-1
zpe.correction: 0.322657 hartree
zpe.thermalcorrener: 0.340868 hartree
zpe.thermalcorrenthalpy: 0.341812 hartree
zpe.thermalcorrgfe: 0.277077 hartree
zpe.sumelectzpe: -921.838804 hartree
zpe.sumelectthermal: -921.820593 hartree
zpe.sumelectthermalent: -921.819649 hartree
zpe.sumelectthermalfe: -921.884384 hartree
dipole: 2.2966 0.4608 -1.2412
dipole: 2.6509
quadrupole: -130.9930 -117.6183 -131.0341
quadrupole: -4.1312 5.2662 -2.2721
quadrupole: -4.4445 8.9302 -4.4856 -4.1312 5.2662 -2.2721
hfenergy: -922.1614609 hartree
pointgroup: C01 [X(C20H18O2)]
dipole: 0.9010398 -0.1757282 0.4949938 debye
polarizability: 395.2048313|-4.8409473|240.8765638|4.8020799|-14.1243389|111.5207374 unknown
InChI: InChI=1S/C20H18O2/c1-2-14-16-9-7-12-5-3-4-6-15(12)17(16)11-13-8-10-18(21)20(22)19(13)14/h3-11,18,20-22H,2H2,1H3
charge 0 multiplicity 1
40 atoms
O  -3.973007 -1.185231 0.976645
O  -5.541934 1.030778 -0.016268
C  -1.868402 -0.090595 0.016887
C  -3.402317 -0.19248 0.019186
C  -1.009021 -1.208865 0.116205
C  -1.304352 1.218961 -0.235197
C  0.42822 -1.00547 0.139704
C  0.985873 0.31484 -0.027599
C  -4.125587 1.139236 0.337618
C  0.087586 1.391896 -0.258556
C  -1.546359 -2.640488 0.090136
C  2.43902 0.511101 0.009599
C  -2.176444 2.363563 -0.555595
C  -3.521614 2.328854 -0.3551
C  1.338008 -2.117508 0.317177
C  3.298629 -0.631797 0.192511
C  2.708822 -1.939492 0.343224
C  -1.375413 -3.286465 -1.314366
C  3.054722 1.795027 -0.121111
C  4.717269 -0.459918 0.229326
C  4.447882 1.944504 -0.083018
C  5.290672 0.80882 0.091884
H  -3.771396 -0.556019 -0.958984
H  -4.031072 1.29638 1.442875
H  0.473182 2.394734 -0.46741
H  -1.033604 -3.266432 0.844692
H  -2.6136 -2.648166 0.352362
H  -1.697436 3.258203 -0.971199
H  -4.184904 3.166501 -0.591974
H  0.933153 -3.124822 0.442419
H  3.374693 -2.799006 0.485493
H  -1.933081 -2.714581 -2.078289
H  -1.767371 -4.320049 -1.311399
H  -0.317105 -3.318974 -1.629113
H  -3.577349 -1.006713 1.869772
H  2.43736 2.689357 -0.248168
H  -5.874604 0.190348 0.396853
H  5.351907 -1.343239 0.368534
H  4.891688 2.940847 -0.18589
H  6.378581 0.932956 0.120834
