program: Gaussian 09
title: 000189293
version: EM64L-G09RevD.01
frameworkgroup: C1[X(C21H27NO)]
method: RPBEPBE
basis: SDD
operation: Freq
keyword: #p
keyword: freq=noraman
keyword: PBEPBE/SDD
title: #p freq=noraman PBEPBE/SDD
converged: YES YES NO NO
title: Mulliken charges:
elementType: O N C C C C C C C C C C C C C C C C C C C C C H H H H H H H H H H H H H H H H H H H H H H H H H H H
charge: -0.246749 -0.085512 -0.333818 -0.345132 -0.337024 -0.402779 -0.560141 -0.319201 -0.325326 0.504048 0.513409 -0.406695 -0.435319 -0.587687 -0.419127 -0.410471 -0.581717 0.514588 -0.409536 -0.405395 -0.227456 -0.228560 -0.243403 0.177037 0.203285 0.209467 0.189070 0.186762 0.211506 0.225670 0.217894 0.204306 0.202276 0.212602 0.192276 0.192664 0.213644 0.229327 0.229424 0.222906 0.223085 0.229012 0.228647 0.222648 0.222085 0.230622 0.229988 0.222959 0.222909 0.226929
chargesum: 0.00000
title: Mulliken charges with hydrogens summed into heavy atoms:
elementType: O N C C C C C C C C C C C C C C C C C C C C C
charge: -0.246749 -0.085512 0.046505 0.053405 0.061244 0.040786 -0.153558 0.085677 0.080981 0.504048 0.513409 -0.177367 -0.205894 -0.141695 -0.190115 -0.181824 -0.136984 0.514588 -0.178913 -0.175407 -0.004497 -0.005651 -0.016474
polarizability: 3.34696214e+02 2.33311755e+01 1.62335087e+02 -5.58070413e+00 5.42967259e+00 2.12115439e+02
1716.lowfreq: -23.5043 -13.2028 -5.7283 -0.0011 -0.0009 -0.0006 2.9975 8.8585 12.7206
frequency: -18.5286 6.1606 12.3113 16.7157 30.5154 43.1076 50.9129 65.9474 86.6938 99.5740 135.2692 158.1338 192.7169 240.1281 248.2586 267.0935 275.5872 307.5706 334.5750 352.6369 381.3454 391.4996 403.4991 405.6229 422.6993 455.4845 468.6239 491.1330 512.6004 549.7121 593.2209 614.7118 617.4838 638.7543 704.2214 720.9698 754.5265 756.3669 758.7852 777.5859 784.6983 805.4458 820.7217 823.8077 840.5318 848.0873 853.4450 854.5059 864.6660 900.4539 916.9940 954.1202 972.1543 975.2313 982.0696 989.8860 991.8572 996.9255 1001.3929 1013.1319 1025.9759 1026.2393 1030.3065 1048.4478 1052.4720 1057.2506 1076.0808 1087.8637 1099.1285 1117.2688 1130.3355 1139.1731 1144.6953 1171.5352 1186.0793 1187.1359 1189.8489 1189.9313 1214.5299 1217.0717 1219.9937 1240.6296 1262.3345 1265.4155 1265.7367 1265.9821 1277.4206 1291.2914 1295.5006 1318.9975 1319.2400 1326.6397 1329.2559 1332.8029 1345.8364 1363.4662 1373.2475 1379.7220 1382.0475 1390.1390 1409.7892 1439.5738 1443.9507 1446.6126 1449.9440 1456.6174 1465.8635 1472.2235 1472.9997 1483.1959 1486.7135 1488.3527 1506.6588 1582.0028 1592.4975 1613.5621 1623.6526 2827.2708 2850.4286 2865.1559 2954.0559 2958.1019 2970.9594 2985.4034 2989.9301 2994.3197 2999.2558 3020.7390 3022.9170 3033.2089 3043.6023 3060.3519 3060.5448 3079.0798 3082.3822 3105.7461 3107.5936 3112.6555 3113.8235 3127.8952 3130.3532 3134.8935 3142.2373 3161.2303
redmass: 3.1730 3.6276 3.8789 5.1816 3.9464 2.8815 4.8549 3.1365 3.9856 2.4397 4.2115 4.5566 3.1740 1.8123 4.5626 3.7558 2.1818 2.3232 2.3866 3.7899 2.5065 1.9777 2.8148 2.8406 4.6893 3.7490 2.8729 4.0832 3.8976 3.1865 2.1746 2.9029 6.3609 6.6598 1.8622 2.8962 3.0428 1.2204 1.9577 4.2927 1.1912 3.9853 2.3209 2.8958 1.5949 1.3229 1.2520 1.3454 2.4353 2.2502 1.5317 1.4152 1.3859 1.3947 1.6646 6.3001 1.4073 2.8422 3.5806 2.9452 2.4917 2.2109 3.1666 1.8908 2.1561 2.2185 1.5603 3.2081 1.9210 1.4759 2.1181 2.1660 1.2028 1.0515 1.1140 1.5467 1.1252 1.0631 3.0816 2.9790 1.8227 1.2603 1.2912 1.3708 1.4055 1.2687 1.2348 1.1638 1.3464 1.2886 1.3441 1.2524 1.2999 1.3930 1.2701 1.4166 1.2648 5.8920 7.6940 1.4559 2.6682 2.1797 1.0824 1.0797 1.0959 1.0948 1.0806 1.1301 1.1004 2.2310 1.1007 1.1007 2.7171 6.5351 6.0450 6.1712 6.4856 1.0702 1.0709 1.0690 1.0665 1.0666 1.0592 1.0590 1.0665 1.0598 1.0797 1.1004 1.0896 1.1011 1.0887 1.1040 1.1046 1.0962 1.0979 1.0867 1.0868 1.0872 1.0867 1.0962 1.0906 1.0972 1.0957 1.1014
irintensity: 0.0656 0.0079 0.0126 0.0283 0.0342 0.0294 0.3031 0.3467 0.3396 0.1164 1.3312 0.8875 1.7606 2.0408 1.4116 3.0949 0.9582 12.5445 0.5580 1.1031 0.0511 0.0953 0.0001 0.0082 1.8155 1.2610 0.8714 1.4218 11.6221 35.9943 16.9156 1.8572 0.0554 0.0344 45.0702 11.3836 10.8137 2.9271 27.0952 1.5587 0.2080 18.4270 23.4575 29.7698 0.4924 0.5005 0.0443 0.8283 15.2414 11.7671 2.2555 0.0058 0.0087 0.0182 0.1729 0.1086 0.0876 24.5042 0.0934 6.0116 22.0004 2.6695 4.0604 16.0310 15.7803 0.4769 5.9540 38.5138 6.9800 4.8077 49.1328 18.8952 14.6378 0.1578 0.1258 1.5406 0.7760 2.3178 0.1082 0.0113 0.2504 26.7923 2.8021 3.0357 14.6419 2.8066 2.0094 2.1523 12.9033 0.0301 0.5395 0.2041 8.1381 1.3411 12.3669 2.1888 2.8438 0.3099 0.2237 8.2613 3.3025 6.1071 2.4826 1.0525 20.1223 3.2755 0.6384 0.5186 0.1652 21.8576 10.3444 14.2240 47.0280 0.0967 1.6974 15.1844 1.0266 62.3175 52.8134 164.7297 30.8047 102.4811 32.2183 0.6330 11.8414 65.4929 40.2549 9.6610 45.6514 0.0422 42.1108 15.5503 60.6292 43.8831 37.5056 2.5444 38.0405 9.3504 8.9164 45.7148 10.1750 0.7088 46.5494 28.3317
temp: 298.150 k
press: 1.00000 atm
elementType: 8 7 6 6 6 6 6 6 6 6 6 6 6 6 6 6 6 6 6 6 6 6 6 1 1 1 1 1 1 1 1 1 1 1 1 1 1 1 1 1 1 1 1 1 1 1 1 1 1 1
symmnumber: 1
zpe: 1127709.4 jmol-1
zpe.correction: 0.429522 hartree
zpe.thermalcorrener: 0.450619 hartree
zpe.thermalcorrenthalpy: 0.451563 hartree
zpe.thermalcorrgfe: 0.373450 hartree
zpe.sumelectzpe: -944.668893 hartree
zpe.sumelectthermal: -944.647796 hartree
zpe.sumelectthermalent: -944.646852 hartree
zpe.sumelectthermalfe: -944.724965 hartree
dipole: 0.9213 -1.3205 0.1300
dipole: 1.6153
quadrupole: -148.4350 -146.8870 -127.8442
quadrupole: 14.8868 -4.6964 1.1983
quadrupole: -7.3796 -5.8316 13.2112 14.8868 -4.6964 1.1983
hfenergy: -945.0984147 hartree
pointgroup: C01 [X(C21H27N1O1)]
dipole: -0.3561909 0.523809 -0.051322 debye
polarizability: 335.1962764|21.9753292|161.5911757|1.9320858|4.4226296|212.3592874 unknown
InChI: InChI=1S/C21H27NO/c1-2-5-19(6-3-1)8-11-21-12-9-20(10-13-21)7-4-14-22-15-17-23-18-16-22/h1-3,5-6,9-10,12-13H,4,7-8,11,14-18H2
charge 0 multiplicity 1
50 atoms
O  7.646086 -2.223223 0.22323
N  5.520894 -0.231173 0.301604
C  4.723722 0.927468 -0.172022
C  6.941906 0.135753 0.540978
C  5.44974 -1.403559 -0.609398
C  3.201091 0.693707 -0.104599
C  2.406166 1.98067 -0.461477
C  7.705751 -1.062278 1.127074
C  6.238544 -2.582862 -0.016423
C  0.900148 1.774535 -0.388075
C  -1.934199 1.31767 -0.226108
C  0.227558 1.783056 0.86143
C  0.129501 1.538763 -1.554746
C  -3.424899 1.032534 -0.134411
C  -1.163481 1.559088 0.940724
C  -1.262875 1.313351 -1.475153
C  -3.728639 -0.496769 0.004507
C  -5.219083 -0.778782 0.111843
C  -5.861348 -0.823502 1.376541
C  -6.010851 -0.959934 -1.05219
C  -7.254187 -1.040812 1.477611
C  -7.403962 -1.177727 -0.957585
C  -8.031485 -1.217884 0.309383
H  5.008008 1.224429 -1.216902
H  4.974473 1.787153 0.481376
H  6.978159 0.979501 1.256453
H  7.448288 0.461896 -0.403514
H  5.863341 -1.15551 -1.621126
H  4.395534 -1.708359 -0.73734
H  2.937363 0.359952 0.916767
H  2.89182 -0.113416 -0.796092
H  2.693101 2.311118 -1.479294
H  2.711702 2.787646 0.234802
H  8.778113 -0.83377 1.244374
H  7.269844 -1.332776 2.113162
H  5.766038 -2.899191 0.938646
H  6.267286 -3.433983 -0.716879
H  0.799364 1.97686 1.778112
H  0.624543 1.540573 -2.534259
H  -3.864795 1.555063 0.736371
H  -3.948778 1.410954 -1.032923
H  -1.662447 1.58152 1.918139
H  -1.838567 1.143179 -2.394111
H  -3.197071 -0.87653 0.897716
H  -3.297261 -1.017925 -0.871437
H  -5.263123 -0.693768 2.28756
H  -5.529679 -0.936714 -2.038495
H  -7.731817 -1.076987 2.463564
H  -7.998097 -1.320244 -1.867651
H  -9.111138 -1.389562 0.385442
