program: Gaussian 09
title: 000189291
version: EM64L-G09RevD.01
frameworkgroup: C1[X(C5H6ClN5O)]
method: RPBEPBE
basis: SDD
operation: Freq
keyword: #p
keyword: freq=noraman
keyword: PBEPBE/SDD
title: #p freq=noraman PBEPBE/SDD
converged: NO YES NO YES
title: Mulliken charges:
elementType: Cl O N N N N N C C C C C H H H H H H
charge: 0.015845 -0.172186 -0.375961 -0.142847 0.066138 0.000349 -0.577455 0.144041 0.221767 0.076021 -0.793381 -0.250179 0.342738 0.240855 0.272111 0.240824 0.349402 0.341917
chargesum: 0.00000
title: Mulliken charges with hydrogens summed into heavy atoms:
elementType: Cl O N N N N N C C C C C
charge: 0.015845 -0.172186 -0.033223 -0.142847 0.066138 0.000349 0.113864 0.144041 0.221767 0.076021 -0.039591 -0.250179
polarizability: 1.47350390e+02 -4.37262611e+00 1.30017776e+02 4.97017383e-03 3.79029681e-03 4.64509394e+01
1716.lowfreq: -3.4312 0.0008 0.0024 0.0028 5.1015 6.4916 24.5774 46.5686 77.3716
frequency: 24.5458 46.5518 77.3703 104.0751 150.9410 179.7891 223.9934 240.7501 277.7369 322.9417 400.7295 469.8191 529.3210 530.5555 558.1095 570.9459 575.4399 650.8329 687.9927 709.7201 743.5736 803.2587 874.1947 883.8781 902.9680 970.5002 991.3175 1033.6610 1073.8954 1176.8955 1245.2786 1260.5177 1366.8005 1375.8172 1412.8477 1449.7205 1466.7388 1480.5705 1517.9380 1532.9047 1623.5226 1672.3595 2988.3560 3074.2868 3140.4074 3517.9997 3550.7488 3708.6751
redmass: 1.5132 2.4976 3.7104 7.6153 11.0264 7.3399 6.0717 5.4732 6.0034 4.1902 12.8817 4.3352 1.1919 5.0916 1.1192 2.6461 6.1133 7.1208 2.3795 6.5830 2.0185 9.5694 10.0937 4.9348 6.6045 3.3896 2.0647 1.6941 2.5904 2.9061 7.0415 6.9833 2.7229 1.2335 7.2201 1.1152 1.0468 8.2069 2.2567 2.3271 1.9452 7.0847 1.0383 1.0983 1.0983 1.0761 1.0447 1.1060
irintensity: 3.1169 1.5980 1.9600 2.2784 0.7616 2.5192 3.3424 1.2024 6.0952 2.2483 6.0024 4.2683 254.4275 31.0792 40.9858 0.0739 12.5492 0.2333 55.3979 24.0648 38.1831 48.1526 20.7270 5.9133 27.7755 70.5779 37.0003 10.1811 10.2482 209.7529 142.7520 155.1674 185.7788 48.5198 280.6867 84.1667 20.9306 1105.7615 536.1798 64.0351 377.2173 160.3197 5.5919 12.9934 7.0385 31.9390 141.2034 57.7414
temp: 298.150 k
press: 1.00000 atm
elementType: 17 8 7 7 7 7 7 6 6 6 6 6 1 1 1 1 1 1
symmnumber: 1
zpe: 324019.3 jmol-1
zpe.correction: 0.123412 hartree
zpe.thermalcorrener: 0.135023 hartree
zpe.thermalcorrenthalpy: 0.135967 hartree
zpe.thermalcorrgfe: 0.083588 hartree
zpe.sumelectzpe: -1002.317270 hartree
zpe.sumelectthermal: -1002.305659 hartree
zpe.sumelectthermalent: -1002.304715 hartree
zpe.sumelectthermalfe: -1002.357094 hartree
dipole: 1.0948 7.4104 0.0020
dipole: 7.4909
quadrupole: -63.4396 -71.6543 -76.2313
quadrupole: -0.5697 0.0110 -0.0052
quadrupole: 7.0022 -1.2126 -5.7896 -0.5697 0.0110 -0.0052
hfenergy: -1002.4406825 hartree
pointgroup: C01 [X(C5H6Cl1N5O1)]
dipole: 0.1593607 -2.942818 -0.0051781 debye
dipolederiv: -0.202457 -0.2485838 -0.0005277 -0.3000509 -0.8782062 -0.0017074 -0.0005226 -0.0013804 -0.0756932 -0.704504 0.012462 -0.0000434 0.4746716 -0.7896587 0.0002016 0.00074 -0.0007646 -0.2918551 -2.4612202 0.0693393 -0.0005938 0.0842808 -0.3972965 0.000181 -0.0012207 0.0001951 -0.3812893 -1.6371888 0.3788701 0.0005178 0.2022501 -0.7086807 -0.0009743 0.0001796 -0.0009529 -0.2345629 -1.3409469 -0.562029 -0.0012643 -0.6801012 -0.9659945 -0.0021256 -0.0016753 -0.0019658 -0.1122228 -0.7849181 0.2469171 0.0003739 0.3378214 -1.444537 -0.0028135 0.0008258 -0.0028708 -0.1640081 -0.9454061 0.6689712 0.0014377 0.7449064 -0.8905364 -0.0003368 0.0016149 -0.0003503 -0.6991954 2.3085889 0.0335834 0.0006749 0.606661 0.9936584 0.0021199 0.0014891 0.001851 0.2376471 2.1763069 -0.0504196 0.0005572 -0.7993466 1.0955988 -0.0000645 -0.0007648 0.0008409 0.1949772 1.6665445 -0.6723113 -0.0012393 -0.6884553 1.456889 0.0026782 -0.00142 0.0025376 0.2345503 -0.3916652 -0.1716583 -0.00015 -0.2895644 -0.1803255 -0.0003042 -0.0000292 -0.0001921 0.0531932 1.5110864 0.3150133 0.0007116 0.3228238 1.9747434 0.0040912 0.0007831 0.0038999 0.060646 0.1968593 0.0267819 -0.0000976 0.0187323 0.1561621 -0.0002283 0.0001636 -0.0002458 0.3111943 0.0773335 0.004498 0.0460177 -0.0157393 0.0369939 -0.09858 0.0002532 -0.1090308 -0.0253201 -0.0271963 0.0421103 0.0002217 0.1082434 0.045407 -0.0002683 0.0004862 -0.0001568 0.1338961 0.0769945 0.0049254 -0.0463519 -0.0153799 0.0361669 0.0988627 -0.0006129 0.1092975 -0.0243668 0.3004817 -0.0741157 -0.0001669 -0.0231706 0.1847083 -0.0004558 -0.0000561 -0.0004474 0.3910972 0.1813067 -0.0243543 -0.0000775 -0.0885826 0.2749075 -0.0002759 -0.000234 -0.0002644 0.3913122 unknown
polarizability: 148.3700563|-0.6376688|128.9977785|0.0220641|0.1641681|46.4512708 unknown
InChI: InChI=1S/C5H6ClN5O/c1-2(12)8-5-10-3(6)9-4(7)11-5/h8H,7H2,1H3
charge 0 multiplicity 1
18 atoms
Cl 1.935882 2.947641 0.007045
O  -2.814648 1.246951 0.000571
N  -1.554499 -0.75851 -0.001327
N  0.673918 -1.383661 -0.002306
N  0.099568 0.984847 0.00303
N  2.432706 0.310562 0.001636
N  2.94674 -1.975982 -0.00345
C  -0.222975 -0.34545 -0.000046
C  -2.761693 -0.002251 -0.001401
C  1.990392 -1.003216 -0.001412
C  -3.99678 -0.905717 -0.001635
C  1.432268 1.209942 0.003886
H  -1.641774 -1.779568 -0.00291
H  -4.017573 -1.55263 -0.898313
H  -4.894612 -0.272085 0.000609
H  -4.015549 -1.556278 0.892435
H  3.926539 -1.701348 -0.00276
H  2.668191 -2.954049 -0.005654
