program: Gaussian 09
title: 000189289
version: EM64L-G09RevD.01
frameworkgroup: C1[X(C19H24O8)]
method: RPBEPBE
basis: SDD
operation: Freq
keyword: #pfreq=noraman
keyword: PBEPBE/SDD
title: #p freq=noraman PBEPBE/SDD
converged: YES YES NO NO
title: Mulliken charges:
elementType: O O O O O O O O C C C C C C C C C C C C C C C C C C C H H H H H H H H H H H H H H H H H H H H H H H H
charge: -0.264244 -0.469341 -0.459409 -0.347039 -0.449296 -0.190423 -0.223249 -0.440399 -0.227241 -0.249066 0.187117 -0.153915 -0.156013 -0.535787 -0.227511 0.540532 -0.043068 -0.650411 -0.463191 0.284957 0.075329 -0.796484 -0.661789 0.214047 0.327975 -0.443771 -0.617803 0.276161 0.229663 0.265026 0.246391 0.262840 0.224524 0.265037 0.278378 0.219847 0.259543 0.258889 0.250431 0.362928 0.377344 0.284882 0.230718 0.364057 0.241434 0.260207 0.198330 0.227563 0.236965 0.259820 0.358517
chargesum: 0.00000
title: Mulliken charges with hydrogens summed into heavy atoms:
elementType: O O O O O O O O C C C C C C C C C C C C C C C C C C C
charge: -0.264244 -0.106413 -0.082065 -0.347039 -0.085238 -0.190423 -0.223249 -0.081881 0.048920 -0.019404 0.187117 0.111111 0.090377 -0.048424 0.037525 0.540532 0.235311 -0.171022 0.046130 0.284957 0.075329 -0.280884 -0.160148 0.214047 0.327975 -0.017878 -0.121019
polarizability: 2.92620941e+02 7.47791580e+00 2.15704730e+02 -7.76715390e+00 1.12297352e+01 1.75425054e+02
1716.lowfreq: -5.5133 -0.0004 0.0005 0.0008 4.4692 7.6416 21.5387 29.0632 42.5662
frequency: 21.3939 29.0589 42.5628 53.2666 55.5463 69.5502 83.1670 95.3121 99.4962 122.8724 136.6888 140.8904 165.1135 184.2815 200.8406 223.1736 235.1784 243.6678 258.9015 274.2761 286.2980 299.4771 315.5570 331.6503 341.2315 353.2056 356.2238 383.2627 389.8693 405.0637 410.9773 446.0895 451.9356 473.1676 482.4863 490.6480 502.2386 548.5172 559.5306 563.7364 590.9905 593.6055 612.1090 635.6987 640.6542 665.3635 680.7968 692.6466 708.6052 739.1139 758.7598 773.9520 778.8767 785.6663 787.6608 802.8942 805.4850 849.3240 867.7208 889.6149 912.0889 923.1980 935.8981 950.7200 958.6696 968.6511 972.2631 978.2348 986.0937 988.4708 993.5159 997.1464 1011.0482 1023.1379 1030.7136 1034.6801 1042.9249 1060.6059 1063.2123 1085.2688 1093.7660 1117.9128 1137.7667 1155.4412 1163.1746 1176.9754 1180.8627 1204.0681 1211.4233 1224.3511 1240.5163 1244.2676 1254.1291 1270.9443 1279.2217 1284.5523 1285.2610 1289.9100 1299.9451 1307.6486 1315.4434 1320.2392 1329.3474 1333.7727 1351.2910 1356.8025 1366.9285 1371.4845 1377.7100 1388.6304 1397.4825 1412.0953 1424.0769 1435.6721 1461.7398 1462.8825 1468.3092 1470.0078 1623.3745 1648.7212 1659.9743 1665.8538 1694.0070 2946.4801 2968.3293 2972.8993 2976.6186 2987.4427 2994.5192 2999.7324 3016.8527 3022.6535 3033.2877 3063.4620 3076.4383 3087.9023 3091.4669 3098.2494 3104.6455 3109.4452 3185.5642 3215.8087 3231.6011 3362.7917 3489.6444 3509.6441 3525.2854
redmass: 5.8030 5.5961 5.4462 5.1611 5.5955 7.8242 5.2564 6.8441 5.7005 3.4030 4.9272 3.4461 6.1581 5.3641 4.7618 4.9867 5.4478 5.5476 4.8023 4.6275 3.9825 3.9697 4.1936 3.8216 3.7092 3.5592 3.0909 3.4737 3.3024 3.7188 4.5376 2.6119 4.7573 3.4268 1.8484 1.5881 1.1449 3.7116 3.4403 3.3146 3.4965 1.2885 3.4275 3.7923 3.2566 3.6724 2.1117 3.5325 2.4650 1.6102 1.2660 2.2875 2.2371 2.2356 3.1515 6.1082 2.9339 2.4740 2.7740 3.0783 2.4005 3.1518 2.9129 4.2378 4.1419 2.0709 2.5851 3.1531 2.6397 1.6823 1.4025 1.5798 1.4305 3.9341 2.4084 2.6392 2.3977 2.5874 3.5738 4.7093 2.8763 2.7981 1.7153 1.7459 1.1944 1.6346 1.5723 1.4314 1.3127 1.6203 1.6270 1.5714 1.8640 1.2652 1.7333 1.6399 1.3939 1.2040 1.2232 1.3632 1.2550 1.2870 1.2950 1.3414 1.4738 1.4973 1.4855 1.3003 1.1884 1.5117 1.4652 1.1730 1.1800 1.1429 1.0929 1.0874 1.0904 1.0917 10.1385 5.7911 4.9992 6.9656 11.6879 1.0693 1.0718 1.0769 1.0814 1.0827 1.0830 1.0649 1.0846 1.0696 1.0851 1.0969 1.0633 1.0933 1.0999 1.1007 1.0620 1.0632 1.1156 1.1158 1.1135 1.0654 1.0645 1.0658 1.0647
irintensity: 1.4282 0.0508 0.6732 1.1134 3.9106 4.1899 6.0395 1.1144 6.5238 3.6815 2.4513 2.4990 1.1651 1.1000 17.5718 1.3584 1.7005 0.9831 2.6650 4.2490 4.7264 2.0195 8.3526 6.1173 7.5834 3.2947 1.8177 0.2880 9.7480 0.4268 1.7023 12.5337 7.9012 22.6782 56.6372 38.2411 43.4356 17.9452 0.7828 20.1348 10.7272 161.3770 5.9818 28.0111 6.5964 1.3860 20.2709 12.3536 7.5463 54.6273 179.4508 11.8286 15.0642 4.4821 5.3103 11.5411 14.9145 29.8792 27.3894 33.4947 29.6278 104.4039 68.5488 14.5459 75.6569 33.6137 52.1185 42.7050 35.5223 42.1671 45.9033 58.1582 46.0084 68.6671 20.3917 87.7264 83.4962 156.1312 142.0383 255.6134 0.3036 6.1610 3.5505 26.7772 49.2654 10.7720 79.2735 4.4883 12.9755 34.5339 39.4560 6.3385 32.4725 6.9649 23.5724 44.2962 28.1550 7.3289 5.0479 0.2140 28.2825 16.9674 8.0898 10.7318 29.7055 3.4031 13.6302 31.4145 20.9618 1.3636 25.2411 19.3780 45.6557 17.5674 21.8750 3.8861 20.1645 7.4949 109.1580 24.0697 10.5151 36.8927 281.2139 61.5428 3.6724 17.6354 11.4197 16.3406 25.0667 33.6084 16.7278 52.6326 16.1595 8.3391 16.2937 26.5489 8.0711 7.7625 3.9101 1.5569 4.0168 3.1974 0.4502 106.1191 24.5983 16.0745 36.5519
temp: 298.150 k
press: 1.00000 atm
elementType: 8 8 8 8 8 8 8 8 6 6 6 6 6 6 6 6 6 6 6 6 6 6 6 6 6 6 6 1 1 1 1 1 1 1 1 1 1 1 1 1 1 1 1 1 1 1 1 1 1 1 1
symmnumber: 1
zpe: 1067853.9 jmol-1
zpe.correction: 0.406724 hartree
zpe.thermalcorrener: 0.432435 hartree
zpe.thermalcorrenthalpy: 0.433379 hartree
zpe.thermalcorrgfe: 0.351045 hartree
zpe.sumelectzpe: -1338.087786 hartree
zpe.sumelectthermal: -1338.062076 hartree
zpe.sumelectthermalent: -1338.061131 hartree
zpe.sumelectthermalfe: -1338.143466 hartree
dipole: 3.5254 -0.3184 1.0668
dipole: 3.6970
quadrupole: -156.1416 -182.7784 -167.7968
quadrupole: 2.0160 -11.7454 1.3663
quadrupole: 12.7640 -13.8728 1.1088 2.0160 -11.7454 1.3663
hfenergy: -1338.4945104 hartree
pointgroup: C01 [X(C19H24O8)]
dipole: -1.3665154 0.0736039 0.4928266 debye
polarizability: 291.8051865|12.2434368|214.7114316|0.8569402|-14.995638|177.2341068 unknown
InChI: InChI=1S/C19H24O8/c1-8-4-12(26-17(23)9(2)6-20)14-10(3)18(24)27-16(14)15-11(8)5-13(22)19(15,25)7-21/h11-16,20-22,25H,1-7H2
charge 0 multiplicity 1
51 atoms
O  1.487697 -2.185055 -0.025048
O  4.331019 -0.777379 0.645186
O  4.244375 2.438016 -0.859876
O  -2.726887 0.129629 0.163625
O  4.886668 0.029552 -1.950089
O  0.526557 -4.305978 0.067924
O  -3.485956 0.80595 -1.942399
O  -4.493094 0.788988 2.237075
C  1.98575 0.105289 0.646438
C  1.493711 1.580266 0.862338
C  3.402713 0.189609 -0.007041
C  0.991616 -0.769521 -0.107554
C  3.946322 1.630043 0.328477
C  2.82467 2.344834 1.115012
C  -0.470376 -0.788155 0.437976
C  0.582956 2.079978 -0.266722
C  -1.31111 0.25906 -0.321949
C  -0.899683 1.742267 -0.093413
C  3.47738 -0.103972 -1.523232
C  -0.864937 -2.253178 0.26666
C  0.382684 -3.073679 0.094751
C  1.022446 2.807824 -1.327462
C  -2.0790 -2.856797 0.292335
C  -3.744308 0.46398 -0.766817
C  -5.100489 0.344191 -0.142382
C  -5.214932 -0.092436 1.312409
C  -6.178886 0.641079 -0.917666
H  2.135378 -0.341649 1.651109
H  0.88419 1.60496 1.78796
H  0.96767 -0.512253 -1.18303
H  4.865338 1.502825 0.933831
H  2.773305 3.405105 0.818341
H  3.053737 2.307691 2.195677
H  -0.46495 -0.538369 1.518957
H  -1.312785 0.03189 -1.404983
H  -1.209701 2.009369 0.938324
H  -1.50329 2.351661 -0.788463
H  2.917173 0.636491 -2.114771
H  3.115844 -1.126135 -1.745945
H  3.883637 -1.666121 0.651042
H  4.832205 1.882102 -1.451761
H  2.080153 3.077103 -1.437758
H  0.32559 3.153815 -2.100927
H  5.417638 -0.510445 -1.302815
H  -3.005591 -2.297635 0.437827
H  -2.13718 -3.944498 0.165465
H  -4.866975 -1.142369 1.425221
H  -6.268821 -0.042916 1.629106
H  -7.198239 0.586904 -0.520427
H  -6.051504 0.943682 -1.963122
H  -3.532131 0.733987 1.99119
