program: Gaussian 09
title: 000189287
version: EM64L-G09RevD.01
frameworkgroup: C1[X(C16H21N7O6)]
method: RPBEPBE
basis: SDD
operation: Freq
keyword: #p
keyword: freq=noraman
keyword: PBEPBE/SDD
title: #p freq=noraman PBEPBE/SDD
converged: YES YES NO NO
title: Mulliken charges:
elementType: O O O O O O N N N N N N N C C C C C C C C C C C C C C C C H H H H H H H H H H H H H H H H H H H H H
charge: -0.280034 -0.501230 -0.505010 -0.442980 -0.215228 -0.480923 -0.234736 -0.479721 -0.027920 -0.062466 -0.453260 -0.274899 -0.094735 -0.166088 -0.022701 -0.187312 -0.043162 -0.391915 0.345620 -0.236562 -0.159256 0.168732 0.014825 0.406167 -0.403692 0.194833 -0.402769 -0.322890 -0.789426 0.299098 0.253203 0.281706 0.246449 0.239792 0.234013 0.392488 0.377420 0.282214 0.375869 0.356040 0.368135 0.240168 0.235491 0.311809 0.212531 0.254728 0.277879 0.218321 0.222110 0.369273
chargesum: 0.00000
title: Mulliken charges with hydrogens summed into heavy atoms:
elementType: O O O O O O N N N N N N N C C C C C C C C C C C C C C C C
charge: -0.280034 -0.108742 -0.127590 -0.086940 -0.215228 -0.111650 -0.234736 -0.103853 -0.027920 -0.062466 -0.085125 -0.274899 -0.094735 0.133010 0.230502 0.094394 0.203287 0.081889 0.345620 0.045652 -0.159256 0.168732 0.014825 0.406167 0.071968 0.194833 -0.090960 0.144369 -0.071116
polarizability: 3.57273506e+02 -1.27114520e+01 2.75483719e+02 8.77264821e+00 1.50172167e+01 1.40164250e+02
1716.lowfreq: -7.0149 -6.1560 -0.0009 -0.0005 0.0006 1.5325 9.4936 19.1641 23.5827
frequency: 9.0932 18.8573 23.4123 36.0726 40.2637 51.7463 69.3161 78.1730 85.5610 104.6966 106.5953 133.0814 148.0944 164.3109 171.2687 172.2829 186.5135 200.9334 206.7616 210.4608 234.0601 237.7924 241.8481 262.3072 266.4412 285.3442 300.7566 304.5368 324.1298 337.8906 340.0138 365.1095 388.3401 423.7125 436.0324 464.4760 480.3407 504.2348 535.1492 573.8744 581.9736 587.2325 610.7160 618.6676 642.4725 644.3702 653.5771 655.2592 672.5412 677.2748 711.9136 714.5018 728.9248 755.0697 775.6940 780.3252 807.3525 826.3069 830.2954 842.7557 847.2808 854.0613 888.2422 910.4842 925.7949 936.6801 953.8739 958.6108 970.1606 972.5475 1005.0501 1030.0974 1032.4282 1038.4277 1040.4097 1045.1643 1051.9463 1056.6138 1090.5194 1097.8747 1123.5280 1139.6313 1149.9082 1159.2756 1168.5516 1195.6638 1208.6035 1219.4006 1237.9078 1242.7361 1246.2827 1261.5000 1265.8280 1271.8350 1293.1404 1305.2641 1313.0360 1314.4401 1326.1345 1338.2145 1346.4312 1349.1991 1358.6460 1364.7305 1367.8980 1369.7044 1377.3788 1385.3383 1393.5263 1397.2362 1425.4022 1449.0562 1455.1692 1468.0249 1469.8565 1473.2822 1510.8430 1535.8760 1549.5303 1583.2856 1603.6125 1633.8829 1646.0545 2961.5193 2961.6363 2979.7766 3003.5259 3014.4180 3016.9376 3029.9855 3049.6088 3066.1362 3079.2291 3090.1850 3099.1309 3113.0007 3195.9629 3262.6707 3278.1031 3341.0580 3405.2087 3590.4545 3615.7426 3618.9777
redmass: 6.5057 5.5444 5.6631 4.5659 5.7161 5.6699 4.8370 5.3731 4.7061 4.5421 4.4177 3.5648 4.6645 1.1412 3.9626 5.1761 3.6865 5.0274 5.3000 1.3104 3.3031 2.5150 4.4011 3.6407 1.9995 1.4995 5.9461 4.9337 4.7716 5.9732 3.0602 4.6165 5.2966 4.2332 4.7444 3.8059 2.6051 7.2377 4.5808 2.4756 4.0799 2.2393 3.4326 3.8913 7.9912 7.3536 6.4261 5.2893 5.7543 6.4356 5.0801 1.4067 3.5882 1.8765 2.7115 3.0677 3.9562 3.2139 3.0897 1.3105 6.2269 1.7124 2.3359 3.2516 4.0506 2.0244 2.6199 5.2085 2.2383 5.4050 3.7836 4.2941 3.1262 2.1208 1.9468 2.4914 2.1132 2.3518 2.6186 5.1054 2.3769 1.5946 1.5725 1.7830 1.4588 1.8640 4.3329 1.3869 2.0485 1.5563 1.6329 1.8898 1.7808 1.3077 2.5897 1.4029 1.2165 1.3402 1.3139 3.8825 1.5615 1.9497 2.3784 1.2436 1.7205 1.7395 1.4202 2.5943 1.2260 1.2669 3.9118 1.1012 1.1012 1.2697 1.0791 1.0494 4.1800 10.1499 2.6707 8.6173 4.2625 8.7893 1.5761 1.0744 1.0494 1.0663 1.0641 1.0681 1.0786 1.0980 1.0879 1.0948 1.0887 1.1060 1.1034 1.0941 1.0828 1.0985 1.0996 1.0829 1.0643 1.0671 1.0671 1.0672
irintensity: 0.6964 0.1905 0.7981 1.0528 1.5897 2.7487 1.9560 2.4120 10.3148 4.6591 3.6702 8.5762 13.0871 0.2626 26.3226 3.4010 54.0254 4.4830 13.6217 118.2293 2.6826 30.0599 20.3802 14.1807 13.8281 126.5345 1.4622 9.3472 4.2869 13.2409 4.0884 5.2976 0.7072 0.5073 3.7573 16.9244 6.1874 4.7647 8.2010 24.0392 11.1317 39.0867 57.2428 24.0056 4.0298 5.2778 1.6018 5.0877 20.7307 7.3190 32.8427 56.8254 9.7781 15.0322 87.1724 5.5743 8.4721 6.8960 42.3041 15.6438 5.3409 112.0360 23.3208 5.6249 23.7737 83.9465 18.5223 21.9314 15.1817 252.5242 11.6573 134.4321 87.9573 8.5344 7.4029 4.5301 54.6842 22.8188 25.9870 105.3270 16.3855 20.5192 20.7095 25.4458 14.1625 73.7861 6.2353 63.1619 56.9938 28.0924 33.3829 11.7554 5.1808 16.0699 111.6432 7.0598 10.5280 7.8965 20.2371 100.3701 77.3780 21.3129 40.5231 4.9088 12.6808 13.2904 9.9759 36.8903 7.6956 34.0104 2.4815 13.4131 9.9557 9.4147 9.1139 16.9947 36.9095 286.3888 215.2017 287.3513 944.5597 434.5571 1.5536 22.9958 73.2162 31.5111 65.6272 12.5109 50.2215 28.4538 8.5152 16.6501 8.1918 29.5140 16.9384 4.9004 532.1292 3.4664 4.4011 481.3619 60.4364 18.0076 22.5020 32.0845
temp: 298.150 k
press: 1.00000 atm
elementType: 8 8 8 8 8 8 7 7 7 7 7 7 7 6 6 6 6 6 6 6 6 6 6 6 6 6 6 6 6 1 1 1 1 1 1 1 1 1 1 1 1 1 1 1 1 1 1 1 1 1
symmnumber: 1
zpe: 1007348.3 jmol-1
zpe.correction: 0.383679 hartree
zpe.thermalcorrener: 0.411661 hartree
zpe.thermalcorrenthalpy: 0.412605 hartree
zpe.thermalcorrgfe: 0.322138 hartree
zpe.sumelectzpe: -1454.686464 hartree
zpe.sumelectthermal: -1454.658482 hartree
zpe.sumelectthermalent: -1454.657537 hartree
zpe.sumelectthermalfe: -1454.748005 hartree
dipole: -10.0123 -19.7690 -3.6032
dipole: 22.4509
quadrupole: -134.0900 -196.0565 -170.9720
quadrupole: -18.9737 -5.5395 6.8616
quadrupole: 32.9495 -29.0170 -3.9325 -18.9737 -5.5395 6.8616
hfenergy: -1455.0701429 hartree
pointgroup: C01 [X(C16H21N7O6)]
dipole: 3.8985676 -7.8104667 -1.3480359 debye
polarizability: 357.4565689|8.6822584|269.2017774|11.8362427|31.9461581|146.2631289 unknown
InChI: InChI=1S/C16H21N7O6/c1-7-17-4-9(22(7)2-3-24)19-16-20-13-10(14(28)21-16)18-6-23(13)15-12(27)11(26)8(5-25)29-15/h4,6,8,11-12,15,19-20,24-27H,2-3,5H2,1H3
charge 0 multiplicity 1
50 atoms
O  4.510447 0.165172 0.787969
O  1.540866 -1.979893 0.364332
O  3.889976 -3.015632 0.637485
O  6.23324 -1.278245 -2.219559
O  -1.035752 4.310004 1.58183
O  -1.799193 -2.492019 -1.019828
N  2.370882 1.119934 1.145328
N  0.01527 0.359823 0.760326
N  1.931017 3.325464 1.579992
N  -1.636757 2.133121 0.921924
N  -2.224211 -0.08783 0.291242
N  -4.456415 -0.994461 -0.030042
N  -5.772694 0.853956 -0.011149
C  2.639353 -1.109353 -0.040596
C  3.108352 -0.144287 1.092821
C  3.928942 -1.91501 -0.345967
C  5.069521 -0.909547 -0.085899
C  5.582784 -0.25622 -1.384311
C  0.990242 1.293047 1.057351
C  2.892048 2.402344 1.48583
C  0.721098 2.647105 1.318605
C  -1.304797 0.877277 0.677087
C  -0.67311 3.135525 1.30539
C  -3.607361 0.122124 0.172721
C  -4.083238 -2.413047 0.024585
C  -5.771794 -0.484575 -0.137776
C  -4.435115 1.246474 0.183062
C  -3.218319 -2.91142 -1.155006
C  -6.984409 -1.336096 -0.366551
H  2.303633 -0.536005 -0.919465
H  3.050959 -0.666289 2.071817
H  3.965177 -2.312448 -1.375577
H  5.904041 -1.392615 0.457149
H  6.25873 0.583229 -1.135833
H  4.746051 0.139467 -1.984287
H  1.974682 -2.759025 0.818309
H  4.529486 -3.727038 0.394589
H  3.958078 2.557902 1.617526
H  0.238273 -0.643886 0.666111
H  7.196984 -1.327462 -2.003763
H  -1.861601 -0.95502 -0.15488
H  -3.561382 -2.633692 0.978045
H  -5.022971 -2.99273 0.025118
H  -4.135071 2.277418 0.330561
H  -3.276355 -4.015034 -1.221444
H  -3.572998 -2.473718 -2.102018
H  -7.847534 -0.657915 -0.452017
H  -6.923506 -1.931199 -1.298648
H  -7.187518 -2.03432 0.469703
H  -1.250232 -3.212555 -0.627693
