program: Gaussian 09
title: 000189271
version: EM64L-G09RevD.01
frameworkgroup: C1[X(C13H10Cl2N2O2)]
method: RPBEPBE
basis: SDD
operation: Freq
keyword: #p
keyword: freq=noraman
keyword: PBEPBE/SDD
title: #p freq=noraman PBEPBE/SDD
converged: YES YES NO NO
title: Mulliken charges:
elementType: Cl Cl O O N N C C C C C C C C C C C C C H H H H H H H H H H
charge: 0.026422 -0.076133 -0.206939 -0.178429 0.010674 -0.679286 -0.716122 0.547388 0.530530 -0.354333 -0.449893 -0.465313 -0.369977 -0.302147 -0.341003 0.497163 -0.310335 -0.380196 0.568486 0.243522 0.233834 0.285075 0.249902 0.256924 0.237900 0.284374 0.224660 0.320893 0.312359
chargesum: 0.00000
title: Mulliken charges with hydrogens summed into heavy atoms:
elementType: Cl Cl O O N N C C C C C C C C C C C C C
charge: 0.026422 -0.076133 -0.206939 -0.178429 0.010674 -0.046034 -0.238766 0.547388 0.530530 -0.069258 -0.199991 -0.208389 -0.132076 -0.302147 -0.056629 0.497163 -0.310335 -0.155537 0.568486
polarizability: 2.74520165e+02 2.34962632e+01 1.69878358e+02 -1.00163227e+01 1.59545203e-01 1.33674647e+02
1716.lowfreq: -3.6314 -2.1988 -0.0027 -0.0025 -0.0020 2.6311 11.7069 14.4200 35.8548
frequency: 11.6555 14.2824 35.8502 42.7819 89.2340 122.1438 157.9113 165.8780 177.6884 201.2215 225.9828 260.3828 281.5418 313.0931 341.3425 359.9976 376.7440 383.1755 422.6597 429.8435 437.1649 461.3441 463.4469 510.4892 515.5227 566.8652 576.0796 634.8243 663.0522 672.7607 680.0601 720.0269 725.2675 766.6442 787.5129 816.5392 837.5678 861.1996 877.1587 882.6876 896.5917 942.7550 954.3456 979.4602 1016.3984 1022.6817 1041.8734 1118.9058 1152.2881 1158.7551 1184.0940 1193.5207 1210.2852 1216.3927 1258.7688 1281.5691 1296.5105 1334.6145 1366.7212 1380.5736 1387.1880 1405.7254 1422.2568 1453.6142 1463.6571 1517.4207 1561.6722 1569.1955 1601.3911 1618.8734 1645.4909 2973.1486 3019.7030 3121.0880 3142.6212 3143.1522 3148.2120 3161.0397 3178.8749 3554.9686 3701.3088
redmass: 9.5812 9.3725 7.4446 13.4369 6.0223 5.4498 8.0016 5.6021 7.9495 13.4217 5.1576 5.9335 3.7339 4.2969 6.7858 4.8312 7.0737 1.2069 7.0803 2.9021 3.2121 1.1577 3.2977 5.3898 6.1158 4.2947 5.6885 5.9143 5.1789 6.5304 5.7588 3.9877 4.8653 6.4059 4.0695 1.5416 1.6244 2.8635 1.7589 2.8548 1.7823 1.5286 1.6624 1.3895 2.1435 4.5444 1.8158 2.1305 1.7610 1.2322 1.1763 2.5320 5.1715 1.9018 1.3462 1.5778 1.9270 2.6336 4.7708 4.1912 8.1522 3.6307 4.4037 1.3573 1.8580 3.5004 7.1118 7.5503 6.4920 1.5657 2.8666 1.0600 1.0998 1.0871 1.0903 1.0954 1.0938 1.0921 1.0948 1.0454 1.1037
irintensity: 0.7110 0.2967 0.9125 0.9372 1.1035 2.5424 1.6182 2.1708 0.9765 0.2350 1.8163 0.9181 7.0378 5.0870 5.5081 2.9939 0.7507 137.8879 3.6903 26.1359 5.6405 137.0715 1.7595 4.1409 1.7212 3.7181 5.1253 2.2189 13.4781 14.7053 17.2750 6.3514 12.5404 37.7590 5.1248 40.6547 31.8746 5.4955 3.3738 35.4592 17.2810 12.6749 13.4405 0.6405 1.8330 19.7352 30.3328 5.9401 13.2100 19.7031 12.1497 100.5482 244.3324 54.3879 3.3908 3.1027 2.0856 44.9181 57.3308 24.3581 5.9744 91.8502 1.7263 39.2262 3.7750 153.8513 24.5335 14.8368 128.5786 27.9379 272.7310 23.8428 9.9698 13.2172 8.0207 15.7110 1.5992 0.0726 1.5373 102.8004 35.3047
temp: 298.150 k
press: 1.00000 atm
elementType: 17 17 8 8 7 7 6 6 6 6 6 6 6 6 6 6 6 6 6 1 1 1 1 1 1 1 1 1 1
symmnumber: 1
zpe: 536329.7 jmol-1
zpe.correction: 0.204277 hartree
zpe.thermalcorrener: 0.221605 hartree
zpe.thermalcorrenthalpy: 0.222549 hartree
zpe.thermalcorrgfe: 0.155361 hartree
zpe.sumelectzpe: -1680.030145 hartree
zpe.sumelectthermal: -1680.012817 hartree
zpe.sumelectthermalent: -1680.011873 hartree
zpe.sumelectthermalfe: -1680.079061 hartree
dipole: 6.2087 -2.8873 1.3529
dipole: 6.9796
quadrupole: -149.6696 -119.8955 -114.7311
quadrupole: 14.9361 15.3683 5.4055
quadrupole: -21.5708 8.2032 13.3676 14.9361 15.3683 5.4055
hfenergy: -1680.234422 hartree
pointgroup: C01 [X(C13H10Cl2N2O2)]
dipole: -2.5331816 -0.973077 0.4200665 debye
polarizability: 268.0119692|-37.6747144|163.7746287|-5.2624719|-14.954607|146.2865715 unknown
InChI: InChI=1S/C13H10Cl2N2O2/c14-10-6-8(1-3-12(10)16)5-9-2-4-13(17(18)19)11(15)7-9/h1-4,6-7H,5,16H2
charge 0 multiplicity 1
29 atoms
Cl 2.307377 1.932465 -1.625755
Cl -5.104428 2.138652 0.908133
O  5.246591 -1.341034 -0.791701
O  5.013843 0.911768 -1.059483
N  4.564456 -0.243079 -0.713084
N  -5.33737 0.379109 -1.575996
C  -0.723037 -0.822519 1.727816
C  0.636264 -0.674084 1.045518
C  -1.927128 -0.4975 0.851693
C  0.88006 0.387067 0.139899
C  1.690973 -1.580662 1.328043
C  -2.83433 0.52828 1.213868
C  -2.185944 -1.221001 -0.342664
C  2.146178 0.565386 -0.450263
C  2.951172 -1.422742 0.7295
C  3.194379 -0.343057 -0.153474
C  -3.948905 0.802853 0.406494
C  -3.303969 -0.938677 -1.145215
C  -4.229296 0.091117 -0.792892
H  -0.736848 -0.162185 2.618287
H  -0.80228 -1.856242 2.118478
H  0.070611 1.076409 -0.118472
H  1.521436 -2.415395 2.01694
H  -2.67624 1.114165 2.125681
H  -1.497885 -2.017481 -0.650292
H  3.770334 -2.120701 0.922626
H  -3.480947 -1.514059 -2.061586
H  -5.976667 1.121247 -1.301688
H  -5.515401 -0.136799 -2.432012
