program: Gaussian 09
title: 000189257
version: EM64L-G09RevD.01
frameworkgroup: C1[X(C11H14BrNO2)]
method: RPBEPBE
basis: SDD
operation: Freq
keyword: #p
keyword: freq=noraman
keyword: PBEPBE/SDD
title: #p freq=noraman PBEPBE/SDD
converged: YES YES NO NO
title: Mulliken charges:
elementType: Br O O N C C C C C C C C C C C H H H H H H H H H H H H H H
charge: 0.003839 -0.242383 -0.378531 -0.206399 0.180135 -0.728345 -0.711492 -0.686595 0.174566 0.419605 -0.268052 -0.429264 -0.190632 -0.183625 -0.234681 0.211427 0.226357 0.223713 0.255830 0.212489 0.223195 0.224534 0.201456 0.238540 0.327416 0.278413 0.234512 0.369568 0.254405
chargesum: 0.00000
title: Mulliken charges with hydrogens summed into heavy atoms:
elementType: Br O O N C C C C C C C C C C C
charge: 0.003839 -0.242383 -0.008963 -0.206399 0.180135 -0.066848 -0.019978 -0.022065 0.174566 0.419605 0.059364 -0.150851 -0.190632 0.050887 0.019724
polarizability: 2.12289714e+02 1.78777466e+00 1.63505855e+02 2.17242426e+00 -5.66517300e-01 8.49240845e+01
1716.lowfreq: -5.0139 -0.0002 0.0004 0.0005 6.9180 8.0933 23.6034 39.6831 71.9369
frequency: 23.4919 39.6284 71.9328 84.6362 132.4305 154.1627 172.0023 186.9333 211.4355 237.1467 255.9950 269.4846 279.5490 292.4430 304.2384 335.4653 346.1345 369.7960 384.6149 405.1184 435.4153 445.7109 547.3715 565.7310 598.9915 647.2466 680.7215 688.7990 703.7935 785.0199 794.0662 871.6985 900.4130 907.5553 930.6774 938.0217 953.8736 973.6592 979.2919 1005.4056 1022.5554 1027.4264 1070.3200 1096.5759 1140.0449 1178.7442 1206.5606 1219.8275 1231.0397 1259.7278 1300.2120 1339.1719 1371.5557 1373.6014 1379.7743 1403.4241 1414.4199 1453.4915 1454.7052 1464.4452 1468.8211 1477.4016 1485.6450 1501.3074 1559.3733 1571.2000 1596.4864 2983.1433 2985.4732 2993.1262 3070.7825 3074.8853 3089.9148 3101.5204 3107.0777 3115.2913 3144.9330 3177.9247 3191.2000 3219.5349 3434.1697
redmass: 4.6546 4.2084 3.5807 7.3128 5.4810 1.3924 4.0735 3.5471 1.0843 1.3082 3.5717 2.3001 4.9391 4.0011 3.4427 1.1914 6.1229 3.2905 2.1168 4.7468 3.2298 3.3797 4.1259 4.8257 7.0080 6.9279 2.9981 4.9456 7.1001 1.3833 4.1895 3.2496 1.3434 1.4525 1.6612 1.6703 1.2075 4.1200 1.4768 7.0719 1.4128 1.4265 2.1096 1.5835 2.9098 1.0921 2.9245 2.8205 2.9180 2.2141 1.5712 1.4798 1.2079 6.4446 1.2009 1.2152 2.9670 1.0725 2.2547 1.0546 1.0483 1.0533 1.0511 1.0684 7.1370 8.6034 6.9381 1.0362 1.0366 1.0363 1.0998 1.0993 1.0998 1.0983 1.0992 1.0985 1.0885 1.0944 1.0954 1.0928 1.0682
irintensity: 1.5083 0.8176 1.4501 0.3652 1.2572 2.1870 5.7573 0.8106 0.2358 0.7000 0.0028 6.2704 0.9670 4.6861 6.2714 114.0780 19.9155 37.2974 8.2902 0.8607 6.6203 2.8579 6.4520 0.6596 4.8054 5.4339 29.3288 44.0285 5.1469 59.0614 25.3460 17.7322 7.8029 18.8527 5.3124 3.3957 0.4511 12.3089 2.7399 18.2658 0.2580 8.6128 14.9094 4.3837 140.6291 8.2767 6.3603 21.4557 76.7324 86.3571 86.5400 126.1772 19.7052 2.4877 17.2378 38.7340 16.9181 9.0410 161.4805 2.0622 1.7825 12.4742 9.8933 41.4067 14.5558 137.1987 84.2499 34.3084 22.9791 36.3961 15.7242 30.2962 47.5898 24.2393 27.8847 18.2476 10.2540 3.4770 3.0895 12.8198 9.2978
temp: 298.150 k
press: 1.00000 atm
elementType: 35 8 8 7 6 6 6 6 6 6 6 6 6 6 6 1 1 1 1 1 1 1 1 1 1 1 1 1 1
symmnumber: 1
zpe: 596140.7 jmol-1
zpe.correction: 0.227058 hartree
zpe.thermalcorrener: 0.243154 hartree
zpe.thermalcorrenthalpy: 0.244098 hartree
zpe.thermalcorrgfe: 0.182430 hartree
zpe.sumelectzpe: -645.052336 hartree
zpe.sumelectthermal: -645.036240 hartree
zpe.sumelectthermalent: -645.035295 hartree
zpe.sumelectthermalfe: -645.096964 hartree
dipole: 2.8451 3.6319 1.8305
dipole: 4.9635
quadrupole: -91.1507 -94.8932 -98.9798
quadrupole: -2.5967 4.4648 1.7370
quadrupole: 3.8572 0.1147 -3.9719 -2.5967 4.4648 1.7370
hfenergy: -645.2793937 hartree
pointgroup: C01 [X(C11H14Br1N1O2)]
dipole: 0.7152833 1.5662124 0.92124 debye
polarizability: 208.2991802|12.4142476|166.1693698|7.1644383|9.4528867|86.2511031 unknown
InChI: InChI=1S/C11H14BrNO2/c1-11(2,3)10(14)13(15)9-6-4-5-8(12)7-9/h4-7,15H,1-3H3
charge 0 multiplicity 1
29 atoms
Br -3.959727 -2.450464 -0.301899
O  1.050718 -1.632011 -0.447853
O  1.035022 1.836123 0.538959
N  0.528853 0.510477 0.219361
C  2.997973 -0.197173 0.060805
C  3.375155 0.26654 1.499866
C  3.429934 0.865577 -0.993343
C  3.745889 -1.5261 -0.232921
C  1.477383 -0.499353 -0.076122
C  -0.900492 0.463604 0.051542
C  -1.600995 -0.772634 -0.050174
C  -1.622557 1.688236 0.026558
C  -3.00211 -0.73845 -0.165658
C  -3.026924 1.673535 -0.089852
C  -3.743467 0.459299 -0.185364
H  3.062563 1.303933 1.700626
H  4.474122 0.224636 1.610031
H  2.9391 -0.40102 2.266376
H  2.917371 1.827816 -0.838982
H  4.520664 1.030201 -0.913626
H  3.216082 0.508529 -2.0172
H  3.497734 -2.30144 0.512292
H  4.835169 -1.340377 -0.203898
H  3.477644 -1.9241 -1.225169
H  -1.052247 -1.712737 -0.057685
H  -1.082959 2.63611 0.069571
H  -3.573228 2.622369 -0.114864
H  0.909321 1.929014 1.526132
H  -4.832492 0.449155 -0.27651
