program: Gaussian 09
title: 000189256
version: EM64L-G09RevD.01
frameworkgroup: C1[X(C13H13BrN2)]
method: RPBEPBE
basis: SDD
operation: Freq
keyword: #p
keyword: freq=noraman
keyword: PBEPBE/SDD
title: #p freq=noraman PBEPBE/SDD
converged: YES YES NO NO
title: Mulliken charges:
elementType: Br N N C C C C C C C C C C C C C H H H H H H H H H H H H H
charge: -0.014599 -0.169926 -0.455686 0.418612 0.495452 -0.650938 -0.377912 -0.361084 -0.309617 -0.444153 -0.221053 -0.210661 -0.163802 -0.174841 -0.262442 -0.254192 0.289510 0.249993 0.224640 0.238550 0.236814 0.258608 0.281672 0.226322 0.221141 0.222622 0.228483 0.227392 0.251096
chargesum: 0.00000
title: Mulliken charges with hydrogens summed into heavy atoms:
elementType: Br N N C C C C C C C C C C C C C
charge: -0.014599 -0.169926 -0.166176 0.418612 0.495452 0.062245 -0.141099 -0.102476 -0.027945 -0.217831 0.000087 0.011961 -0.163802 0.053642 -0.035050 -0.003096
polarizability: 2.22882158e+02 -1.88450149e+01 1.63011872e+02 5.50934683e+00 -9.85466061e+00 1.32786820e+02
1716.lowfreq: -7.1856 -0.0006 -0.0005 0.0005 2.9233 6.7841 17.3084 28.9525 38.4682
frequency: 17.2740 28.8887 38.4344 83.0294 132.8335 156.7554 174.8799 182.1995 217.3757 261.1025 288.2242 297.3064 330.6652 377.0160 383.8915 412.1788 436.8924 504.9286 525.0580 545.9201 563.4348 611.4977 619.8383 652.0003 681.6578 694.7101 756.3928 757.8288 767.1636 824.7808 859.0236 865.1007 877.5200 888.6547 960.6532 962.5673 970.7893 976.8151 982.9211 990.2867 1026.6417 1057.5881 1083.7714 1092.2812 1104.7655 1115.6529 1170.5749 1173.7773 1189.6442 1218.7358 1267.4572 1286.3657 1321.6731 1333.9689 1376.9106 1385.3932 1420.1995 1432.4784 1446.4263 1458.2674 1467.5022 1484.0143 1488.3822 1496.6392 1575.3370 1585.2605 1612.1868 1619.4522 2938.3206 3041.3618 3111.6960 3121.9507 3126.1036 3133.9332 3148.6659 3155.8214 3163.7551 3172.7168 3178.7433 3182.7248 3464.3182
redmass: 6.5609 5.2203 3.8376 3.5140 4.6445 4.9170 1.5632 2.6850 4.6145 2.6886 8.6849 5.8662 4.5295 1.7027 1.7011 2.8281 3.1341 3.0351 4.6647 5.2467 4.6958 6.1865 5.8141 7.1819 2.1644 1.9372 4.9665 1.7361 1.4430 1.2524 5.8498 1.4337 1.4360 1.4576 1.3243 1.3695 5.4405 4.6744 1.3323 4.2729 2.0777 2.0342 1.6283 1.5764 1.3153 1.7632 1.0533 1.0735 1.1150 3.0782 1.4226 2.1151 1.5769 2.7507 4.2088 7.5926 2.6138 1.2863 2.3557 1.8713 1.1242 2.0438 1.1885 2.1185 5.0440 6.3514 6.5575 6.0962 1.0460 1.0901 1.0980 1.0878 1.0847 1.0891 1.0937 1.0925 1.0944 1.0997 1.0918 1.0962 1.0768
irintensity: 0.0928 1.6561 1.2713 1.3176 6.0843 2.0834 0.2646 0.5373 3.2269 2.8308 1.8713 13.7078 5.4589 21.7804 73.8680 0.8721 6.2849 20.1491 11.3167 3.1699 1.8961 1.4057 1.0849 24.0365 26.4072 32.1593 10.8157 93.1058 65.0396 0.5056 57.8384 2.4567 20.9637 7.6595 0.8209 0.0809 16.5300 3.1941 0.2810 8.5946 19.2875 15.7899 1.6544 10.9140 23.9924 24.0127 0.0970 3.8945 3.7911 10.7798 5.0103 65.3011 9.3486 21.2037 37.0768 9.0496 7.8605 1.5263 1.1823 85.2613 34.7589 38.9173 51.8892 139.6467 59.9004 3.6735 358.6142 59.6338 85.5159 23.4667 16.7350 11.9475 4.1845 11.9024 18.9814 32.6138 27.6714 5.4888 1.1689 4.3257 62.3191
temp: 298.150 k
press: 1.00000 atm
elementType: 35 7 7 6 6 6 6 6 6 6 6 6 6 6 6 6 1 1 1 1 1 1 1 1 1 1 1 1 1
symmnumber: 1
zpe: 597474.6 jmol-1
zpe.correction: 0.227566 hartree
zpe.thermalcorrener: 0.242437 hartree
zpe.thermalcorrenthalpy: 0.243381 hartree
zpe.thermalcorrgfe: 0.182677 hartree
zpe.sumelectzpe: -624.970867 hartree
zpe.sumelectthermal: -624.955996 hartree
zpe.sumelectthermalent: -624.955051 hartree
zpe.sumelectthermalfe: -625.015756 hartree
dipole: 2.0512 2.9937 1.2338
dipole: 3.8331
quadrupole: -104.4818 -96.6469 -97.6190
quadrupole: -4.6125 5.3054 -1.9854
quadrupole: -4.8992 2.9356 1.9636 -4.6125 5.3054 -1.9854
hfenergy: -625.1984327 hartree
pointgroup: C01 [X(C13H13Br1N2)]
dipole: -0.4680165 -1.4295801 -0.1069965 debye
polarizability: 228.0835393|2.6208029|147.3411053|-8.7648955|14.588411|143.2562057 unknown
InChI: InChI=1S/C13H13BrN2/c1-16(13-8-3-2-4-9-13)15-12-7-5-6-11(14)10-12/h2-10,15H,1H3
charge 0 multiplicity 1
29 atoms
Br 3.455427 2.711316 1.350373
N  -0.733977 -0.888874 0.805976
N  0.242647 -1.339922 -0.085749
C  -1.901309 -0.28267 0.265856
C  1.495653 -0.717008 -0.206377
C  -0.738958 -1.503931 2.14679
C  -3.086383 -0.159406 1.047185
C  -1.897674 0.227509 -1.064863
C  1.789704 0.477705 0.508297
C  2.484844 -1.292384 -1.054507
C  -4.229381 0.46846 0.506172
C  -3.048952 0.84702 -1.589628
C  3.060228 1.057772 0.354007
C  3.743566 -0.675156 -1.18378
C  -4.225001 0.97556 -0.812333
C  4.058236 0.51252 -0.478742
H  0.05012 -2.19096 -0.623923
H  0.289876 -1.814595 2.385355
H  -1.407299 -2.389444 2.212291
H  -1.058272 -0.767103 2.90539
H  -3.125758 -0.55224 2.06721
H  -0.989442 0.146349 -1.668932
H  1.025719 0.926377 1.147473
H  2.264457 -2.214619 -1.605658
H  -5.131438 0.554574 1.123065
H  -3.02412 1.237984 -2.613347
H  4.498947 -1.122249 -1.839298
H  -5.115878 1.459155 -1.22603
H  5.037315 0.987258 -0.576173
