program: Gaussian 09
title: 000197490
version: EM64L-G09RevD.01
frameworkgroup: C1[X(C11H14O6)]
method: RPBEPBE
basis: SDD
operation: Freq
keyword: #pfreq=noraman
keyword: PBEPBE/SDD
title: #p freq=noraman PBEPBE/SDD
converged: YES YES NO NO
title: Mulliken charges:
elementType: O O O O O O C C C C C C C C C C C H H H H H H H H H H H H H H
charge: -0.229016 -0.288638 -0.466616 -0.457443 -0.453639 -0.434403 -0.130582 -0.179873 -0.071806 -0.042368 -0.349626 0.348255 -0.365319 -0.292075 -0.354639 -0.344859 0.280649 0.225056 0.249674 0.230096 0.215034 0.208182 0.249423 0.367703 0.363772 0.364097 0.248014 0.282379 0.222957 0.252677 0.352936
chargesum: 0.00000
title: Mulliken charges with hydrogens summed into heavy atoms:
elementType: O O O O O O C C C C C C C C C C C
charge: -0.229016 -0.288638 -0.098913 -0.093672 -0.089543 -0.081467 0.094475 0.069801 0.158290 0.172666 0.107979 0.348255 -0.117305 -0.009696 -0.131682 -0.092182 0.280649
polarizability: 1.99820149e+02 -4.51138626e+00 1.35270912e+02 3.14116371e+00 9.69687917e+00 8.23473721e+01
1716.lowfreq: -4.6759 -0.0003 0.0008 0.0008 8.6677 10.9714 31.4657 44.2834 52.4717
frequency: 31.1615 44.2037 52.3857 97.8380 105.0371 156.6317 191.8917 208.1425 231.0572 241.3584 260.4971 287.2581 333.9166 358.7968 377.2346 389.9469 400.0071 412.9866 415.8732 432.4243 439.0512 451.3129 477.5061 500.9409 508.7633 537.4394 582.8816 609.5261 647.6365 701.9337 743.6014 796.4274 820.3848 829.1959 880.3841 900.5725 919.2770 944.7714 964.2008 975.3603 990.0518 999.6097 1027.7443 1041.1742 1057.5000 1070.7015 1097.3921 1100.5420 1106.7100 1143.8898 1164.3620 1169.1101 1194.2860 1203.3315 1219.0520 1249.4499 1253.1868 1258.0799 1299.8055 1307.0243 1309.1077 1315.5297 1336.2389 1359.9954 1377.5983 1389.1736 1393.6490 1395.1734 1429.5829 1466.7740 1496.7997 1598.7178 1631.9368 2922.2216 2958.5148 2968.8514 2987.9672 3005.9259 3116.5988 3122.2052 3162.2582 3165.6881 3181.2248 3550.9528 3563.9463 3569.1481 3586.7010
redmass: 4.3021 5.8522 6.8518 6.4519 6.1572 6.4011 5.2595 4.3985 4.3726 4.7504 3.8153 3.5071 1.1229 4.4569 4.4305 4.2071 1.2794 2.6621 1.2706 1.5638 2.5204 3.6814 5.0169 5.3188 2.5594 4.8518 4.0969 5.0121 6.0555 3.7799 5.8397 1.3149 3.1245 2.1036 2.2577 4.3248 1.3461 1.3408 5.3894 4.8239 5.0607 2.8062 3.3730 4.6346 2.4932 2.6171 2.7303 1.4154 2.4963 1.3669 1.2404 1.1998 2.1752 1.3291 1.1493 2.6953 1.2953 1.2576 1.2107 1.3245 1.2582 1.2040 1.2668 1.4622 1.7029 1.6780 5.4350 1.4555 3.2352 1.0873 2.6660 6.9804 6.6387 1.0832 1.0820 1.0712 1.0819 1.0849 1.0970 1.0898 1.0886 1.0949 1.0971 1.0657 1.0657 1.0658 1.0661
irintensity: 0.7561 0.1736 0.5461 2.0104 2.0104 0.5618 12.7998 2.6212 4.2231 9.3542 22.5696 0.7426 142.5835 13.7218 8.4902 26.2612 102.8712 13.2348 112.4641 179.6594 63.6131 23.0210 15.4390 31.8526 30.5650 5.0811 11.0523 9.9531 14.9403 0.5448 47.7619 22.5697 22.7103 46.3780 23.0396 17.8584 1.0297 0.1639 225.3169 291.1453 24.4325 13.7186 21.6636 67.9291 55.3600 88.9590 5.1109 51.6115 31.8405 237.0918 39.3128 8.8395 204.1713 24.6894 15.0360 0.3642 11.4251 21.4393 2.0774 33.4295 40.5710 0.5878 25.8927 7.7935 5.9864 27.8011 59.9950 5.4879 20.8766 8.1789 230.3839 0.8213 0.6296 28.9586 12.7870 15.9565 49.5298 72.1755 16.1468 19.5113 4.7441 5.4239 1.3241 18.7179 20.9778 12.7308 41.6242
temp: 298.150 k
press: 1.00000 atm
elementType: 8 8 8 8 8 8 6 6 6 6 6 6 6 6 6 6 6 1 1 1 1 1 1 1 1 1 1 1 1 1 1
symmnumber: 1
zpe: 631480.5 jmol-1
zpe.correction: 0.240518 hartree
zpe.thermalcorrener: 0.256737 hartree
zpe.thermalcorrenthalpy: 0.257681 hartree
zpe.thermalcorrgfe: 0.196631 hartree
zpe.sumelectzpe: -877.569690 hartree
zpe.sumelectthermal: -877.553471 hartree
zpe.sumelectthermalent: -877.552527 hartree
zpe.sumelectthermalfe: -877.613577 hartree
dipole: -1.8478 2.7928 -0.4841
dipole: 3.3836
quadrupole: -92.7072 -95.8050 -104.1893
quadrupole: -6.6344 -1.8184 1.8919
quadrupole: 4.8599 1.7622 -6.6221 -6.6344 -1.8184 1.8919
hfenergy: -877.8102084 hartree
pointgroup: C01 [X(C11H14O6)]
dipole: 0.6540106 0.9256106 0.6982964 debye
polarizability: 198.4742663|3.6018532|132.9856311|12.1512823|15.2499869|85.978536 unknown
InChI: InChI=1S/C11H14O6/c12-6-1-3-7(4-2-6)17-11-10(15)9(14)8(13)5-16-11/h1-4,8-15H,5H2
charge 0 multiplicity 1
31 atoms
O  -0.951761 -0.700512 -1.141795
O  0.277455 1.015696 -0.064728
O  -4.551387 0.843673 0.423812
O  -2.037353 1.703187 1.554813
O  -4.488127 -1.815261 -0.729682
O  5.606776 -0.729251 0.568004
C  -3.313433 0.061482 0.368087
C  -2.076012 0.961512 0.289867
C  -3.414674 -0.833552 -0.87494
C  -0.817447 0.09742 0.089313
C  -2.105349 -1.623903 -1.052046
C  1.604006 0.521217 0.091333
C  2.586215 1.492443 0.376063
C  1.955856 -0.841623 -0.051588
C  3.93222 1.102428 0.535766
C  3.299851 -1.23082 0.120125
C  4.286561 -0.263688 0.415069
H  -3.22806 -0.579065 1.274055
H  -2.151501 1.65074 -0.576404
H  -3.587235 -0.183469 -1.758275
H  -0.642517 -0.582124 0.956941
H  -1.979894 -2.332153 -0.205698
H  -2.106918 -2.184634 -1.997895
H  -4.472845 1.483695 1.176844
H  -1.259353 2.31618 1.530146
H  -5.311714 -1.317144 -0.488678
H  2.290771 2.541775 0.468973
H  1.201796 -1.580273 -0.335511
H  4.695068 1.859675 0.757254
H  3.600276 -2.276895 0.011966
H  6.224727 0.019544 0.756511
