program: Gaussian 09
title: 000197459
version: EM64L-G09RevD.01
frameworkgroup: C1[X(C16H20N6O4)]
method: RPBEPBE
basis: SDD
operation: Freq
keyword: #p
keyword: freq=noraman
keyword: PBEPBE/SDD
title: #p freq=noraman PBEPBE/SDD
converged: YES YES NO NO
title: Mulliken charges:
elementType: O O O O N N N N N N C C C C C C C C C C C C C C C C H H H H H H H H H H H H H H H H H H H H
charge: -0.242197 -0.490569 -0.452356 -0.248809 -0.227039 -0.079472 -0.603094 -0.049257 -0.054779 -0.620426 -0.181899 -0.092799 -0.172256 -0.153894 0.207210 0.150601 -0.225135 -0.151045 0.153663 -0.117307 -0.131470 -0.338143 -0.488247 -0.351979 0.136929 -0.690515 0.298627 0.286406 0.278724 0.260728 0.382606 0.377251 0.344749 0.338846 0.346794 0.330202 0.346761 0.205114 0.194820 0.229015 0.234844 0.234662 0.189198 0.212265 0.218273 0.204400
chargesum: 0.00000
title: Mulliken charges with hydrogens summed into heavy atoms:
elementType: O O O O N N N N N N C C C C C C C C C C C C C C C C
charge: -0.242197 -0.107963 -0.075104 -0.248809 -0.227039 -0.079472 0.082545 -0.049257 -0.054779 0.056537 0.116727 0.193608 0.106468 0.106834 0.207210 0.150601 0.119614 -0.151045 0.153663 -0.117307 -0.131470 0.061791 -0.024388 0.071881 0.136929 -0.055577
polarizability: 3.43065832e+02 -2.52620849e+01 2.52339888e+02 -2.69583788e-01 1.08165831e+01 1.37175508e+02
1716.lowfreq: -4.5052 -2.5424 -0.0009 -0.0003 0.0004 7.9973 13.7683 18.9016 23.9597
frequency: 12.3800 18.8209 23.8420 37.3477 50.7898 58.2779 64.2632 67.6140 82.3621 84.9985 113.2387 140.1314 152.0662 176.6187 196.6393 225.9437 233.0758 245.3027 247.4910 261.1001 269.5373 284.7091 298.5953 316.9310 325.4316 332.6713 338.5463 366.0813 393.0193 400.4232 429.1434 461.6538 513.6237 523.7088 533.4562 546.6570 551.3496 553.6343 558.8078 599.3228 604.9767 628.9320 634.2960 643.3911 660.1058 671.4855 684.8575 717.8805 727.8515 744.2649 750.5543 793.2676 801.2288 806.6367 836.6019 859.0068 880.9560 884.8089 893.0978 919.0027 925.5286 953.1863 985.4633 1009.6474 1014.6709 1015.8543 1039.8985 1053.1719 1062.3909 1067.7473 1078.8257 1093.2638 1105.3562 1110.2883 1164.6861 1173.0563 1191.6805 1199.2231 1207.6079 1225.3505 1230.3103 1249.7659 1263.7000 1272.0603 1282.9874 1287.7091 1290.6699 1301.9888 1303.2674 1314.8895 1326.0889 1335.7365 1351.3739 1356.9150 1362.6469 1380.0427 1388.7271 1390.4913 1403.3265 1413.6406 1450.3593 1462.3712 1464.3413 1475.5415 1478.7244 1486.3991 1540.1707 1574.9130 1603.1231 1629.7805 1653.0920 2273.3804 2963.9954 2970.2664 2972.6659 2978.8452 3012.5375 3012.9289 3021.2841 3045.6110 3046.3972 3059.4808 3069.9443 3073.2014 3076.0758 3205.4974 3444.2252 3488.9302 3539.5241 3608.6445 3648.5171 3695.0708
redmass: 4.3151 4.5368 4.7025 5.3535 4.9744 3.7344 5.6451 3.6354 3.7110 3.6659 5.6056 4.6332 5.2140 4.5898 4.7596 1.8367 2.0317 4.1169 2.5132 3.8582 5.3909 6.5202 6.3314 2.5440 1.6377 5.4764 4.9020 5.4210 4.2422 4.2418 6.2604 7.5027 1.2361 6.6913 1.4286 1.0961 1.6575 2.4384 2.6834 1.2084 3.3065 5.0509 5.1107 5.6262 9.2415 5.0037 3.3071 10.8748 3.4181 1.9134 2.9763 9.3592 5.9184 1.9379 2.8510 3.7669 2.8317 2.1841 1.3840 3.6601 1.3918 2.4658 3.3105 3.3548 3.3416 4.6875 4.7803 4.3914 2.4305 3.0142 2.2226 1.8379 2.6322 1.8955 1.2482 3.5103 1.8344 1.3965 1.3314 1.9695 1.3337 2.9716 1.3610 1.3149 4.5571 1.2544 3.0348 1.2219 1.3873 1.4685 1.4275 1.5530 2.5135 1.5832 4.7466 1.4489 1.2128 1.2515 4.6218 6.2486 1.0872 3.2358 1.1937 1.0551 1.0425 1.0841 7.7674 2.0248 1.3381 2.4917 4.5397 11.8623 1.0588 1.0507 1.0466 1.0621 1.0979 1.0846 1.0973 1.1031 1.0874 1.0883 1.1010 1.0994 1.0882 1.1031 1.0643 1.0460 1.0442 1.0670 1.1039 1.1057
irintensity: 0.1535 0.6412 0.0836 1.7024 0.9082 2.6784 10.6781 2.3527 9.4901 3.3904 5.4460 1.5894 6.6865 2.2721 0.7468 1.7158 4.0230 14.5249 1.7341 2.0678 12.3243 3.1737 2.0519 17.6550 88.4463 5.9055 2.8403 5.6041 1.6800 0.2120 0.2266 0.2465 255.7392 6.3765 47.5321 2.7834 10.9501 9.2503 1.1785 378.0868 4.2257 15.6350 47.6578 10.1513 9.2023 5.3236 28.3281 4.6982 21.5664 15.0254 35.0440 15.6461 17.5251 1.2711 4.8922 34.8702 3.9818 8.1807 22.0872 24.5516 8.8668 8.7412 4.2763 7.4020 33.4952 56.4588 172.1401 95.2225 9.0814 17.7872 25.0347 17.7913 23.7119 4.8224 24.5940 15.2159 75.0748 136.8090 2.8229 29.8297 0.6189 149.2291 16.7467 59.2786 11.0630 3.2490 5.0985 0.1210 14.9419 2.0206 2.8574 61.7541 95.4130 1.5944 146.9546 9.2843 11.5745 91.9103 97.3679 150.8700 11.6227 19.8526 6.0109 3.3687 12.1631 14.3790 112.1800 42.7683 70.1076 616.0232 301.2104 117.0921 18.3047 29.8400 25.1074 80.7516 17.0149 29.1217 8.5458 23.6760 11.8991 2.6639 89.1587 53.8715 19.6442 100.7123 49.3867 48.7079 124.5790 27.4851 47.3348 49.0917
temp: 298.150 k
press: 1.00000 atm
elementType: 8 8 8 8 7 7 7 7 7 7 6 6 6 6 6 6 6 6 6 6 6 6 6 6 6 6 1 1 1 1 1 1 1 1 1 1 1 1 1 1 1 1 1 1 1 1
symmnumber: 1
zpe: 941711.6 jmol-1
zpe.correction: 0.358679 hartree
zpe.thermalcorrener: 0.384191 hartree
zpe.thermalcorrenthalpy: 0.385135 hartree
zpe.thermalcorrgfe: 0.299950 hartree
zpe.sumelectzpe: -1249.138383 hartree
zpe.sumelectthermal: -1249.112870 hartree
zpe.sumelectthermalent: -1249.111926 hartree
zpe.sumelectthermalfe: -1249.197112 hartree
dipole: 0.9620 -3.8647 1.5992
dipole: 4.2917
quadrupole: -133.1373 -138.9070 -154.3692
quadrupole: 12.8122 -10.5474 7.5295
quadrupole: 9.0005 3.2308 -12.2313 12.8122 -10.5474 7.5295
hfenergy: -1249.4970616 hartree
pointgroup: C01 [X(C16H20N6O4)]
dipole: -0.4011438 1.186459 1.1323997 debye
polarizability: 339.7802503|-31.9412302|246.4172503|8.4789622|30.924481|146.3837274 unknown
InChI: InChI=1S/C16H20N6O4/c1-2-3-4-5-6-8-20-13(17)9-15(21-8)22(7-19-9)16-11(24)10(23)12(26-16)14(18)25/h7,10-12,16,23-24H,2-4,17-18H2,1H3
charge 0 multiplicity 1
46 atoms
O  3.796099 0.730601 -1.037938
O  2.474734 2.976081 0.662018
O  4.000118 1.783028 2.456448
O  5.351584 -1.498075 -0.314062
N  1.664827 -0.356141 -0.864889
N  1.209266 -2.570434 -1.242379
N  6.26089 -0.358118 1.507122
N  -0.640475 0.505705 -0.578061
N  -2.319908 -1.286464 -0.817264
N  -1.74906 -3.534339 -1.252555
C  2.263408 1.525067 0.659383
C  2.380934 0.935543 -0.770448
C  3.506144 0.940807 1.383164
C  4.550332 0.789149 0.22483
C  5.422041 -0.468888 0.414359
C  0.271802 -0.478237 -0.812261
C  2.181386 -1.641871 -1.13475
C  0.014224 -1.854169 -1.046801
C  -1.358908 -2.239405 -1.04076
C  -1.93353 0.020871 -0.599228
C  -2.989643 0.967436 -0.372676
C  -6.365994 1.984253 0.413786
C  -5.033355 2.695989 0.03792
C  -6.895133 1.048185 -0.695109
C  -3.915374 1.764887 -0.188353
C  -8.219238 0.358668 -0.302569
H  1.303063 1.259095 1.131909
H  1.973579 1.622116 -1.533127
H  3.265456 -0.035845 1.832819
H  5.188878 1.692676 0.200914
H  1.632024 3.443238 0.443876
H  3.763391 2.719357 2.201236
H  3.255144 -1.811417 -1.220624
H  6.852245 -1.150975 1.755675
H  6.209022 0.450004 2.131432
H  -2.741218 -3.760543 -1.243569
H  -1.046773 -4.250496 -1.425838
H  -6.216714 1.405343 1.346086
H  -7.122922 2.763796 0.634993
H  -5.191135 3.300713 -0.879045
H  -4.755209 3.410721 0.838379
H  -6.126171 0.284209 -0.919711
H  -7.040404 1.632684 -1.626803
H  -8.088743 -0.259795 0.605474
H  -8.582862 -0.302117 -1.110592
H  -9.011625 1.102104 -0.091912
