program: Gaussian 09
title: 000197449
version: EM64L-G09RevD.01
frameworkgroup: C1[X(C13H16Cl2O5)]
method: RPBEPBE
basis: SDD
operation: Freq
keyword: #p
keyword: freq=noraman
keyword: PBEPBE/SDD
title: #p freq=noraman PBEPBE/SDD
converged: YES YES NO NO
title: Mulliken charges:
elementType: Cl Cl O O O O O C C C C C C C C C C C C C H H H H H H H H H H H H H H H H
charge: -0.046121 -0.045169 -0.475786 -0.496680 -0.445561 -0.403199 -0.250763 -0.117547 -0.141787 -0.462731 -0.083876 -0.586821 -0.533184 0.635926 0.185438 -0.323717 -0.408595 -0.212943 -0.224498 -0.103637 0.262470 0.232131 0.216006 0.238498 0.262521 0.215878 0.297308 0.287558 0.283943 0.353191 0.372331 0.353721 0.247476 0.280474 0.259447 0.378300
chargesum: 0.00000
title: Mulliken charges with hydrogens summed into heavy atoms:
elementType: Cl Cl O O O O O C C C C C C C C C C C C C
charge: -0.046121 -0.045169 -0.122595 -0.124349 -0.091841 -0.024900 -0.250763 0.144923 0.090344 -0.008226 0.178645 -0.073636 0.038317 0.635926 0.185438 -0.323717 -0.161119 0.067530 0.034949 -0.103637
polarizability: 2.42066886e+02 1.48718489e+00 1.49611549e+02 -7.67284478e+00 2.09970167e+01 1.36364262e+02
1716.lowfreq: -7.5315 -2.4135 0.0021 0.0026 0.0031 7.7489 20.1767 24.9955 35.5682
frequency: 20.0348 24.9162 35.5321 43.8847 53.5739 63.5955 88.8601 93.0848 136.3460 154.2372 165.3637 166.4939 184.2382 198.3040 255.5370 265.5776 279.2820 297.2951 318.2072 343.4117 351.3114 368.3807 386.6225 413.2204 429.3820 447.1354 474.7245 499.8279 513.9360 535.2706 565.8311 575.3809 591.6448 642.0887 645.7653 658.6033 689.7940 716.7496 728.5122 784.4049 816.3795 831.3993 849.6804 866.9622 875.5193 898.6229 931.8923 950.8646 957.4800 991.4422 1018.1463 1024.8528 1037.7081 1046.6659 1068.0621 1087.8101 1097.6136 1104.4956 1132.3272 1162.5929 1174.0173 1187.7271 1212.0507 1217.5751 1248.1560 1259.8765 1280.2728 1292.9191 1311.1991 1313.6329 1323.0369 1335.4750 1355.9562 1362.6379 1368.2561 1371.3079 1376.9068 1381.9504 1404.2282 1434.9191 1458.1492 1465.2104 1492.3061 1568.6418 1593.4772 1647.4598 2963.9670 2992.1989 2994.6916 3011.3038 3028.2496 3053.6001 3064.4401 3064.9057 3083.3119 3136.3858 3176.0611 3183.2073 3368.9138 3428.7534 3505.6231 3551.0595
redmass: 9.8331 9.8666 6.9702 9.5591 8.3711 6.8618 6.1148 5.1917 4.3244 4.2819 5.5515 5.9881 8.6466 4.0347 4.0608 3.9328 4.7119 1.2818 6.1806 6.0295 3.6608 10.1218 4.9085 4.7630 3.5195 3.3705 3.4909 1.9338 3.2327 3.8656 3.6607 1.4296 2.5486 3.3804 1.9149 2.5067 5.8195 1.7719 2.2226 1.4025 1.8850 2.4301 2.5452 1.4017 4.4980 3.2905 2.6744 2.0669 1.6994 3.9063 3.1549 4.0210 2.6310 2.9516 2.1778 2.6500 2.4883 2.2363 1.4487 1.1669 1.2212 1.2497 2.3670 1.3993 1.4391 1.3819 1.3283 1.2799 1.3593 1.2639 1.1930 1.4287 1.3157 1.3941 2.0181 2.0920 4.3836 1.2566 1.5276 1.0877 2.3326 1.1679 1.0936 7.6923 7.5294 7.9164 1.0619 1.0605 1.0843 1.0609 1.0955 1.0923 1.0972 1.0999 1.0887 1.0899 1.0955 1.0936 1.0639 1.0638 1.0639 1.0661
irintensity: 0.5866 0.6274 1.1536 0.4134 0.8210 2.5936 2.0968 1.2741 0.5721 0.5250 3.0059 0.1932 2.9203 3.8214 7.7911 2.0654 29.0975 93.4471 5.6949 1.1442 5.5358 2.6621 1.0770 16.2164 22.7257 4.7118 3.1252 18.5881 21.5938 11.7671 6.9169 126.4608 36.9299 40.2449 105.7894 30.6322 32.7310 111.2051 23.9830 9.0625 43.0968 60.6304 12.1840 20.0810 4.2839 50.4904 67.0178 26.5882 25.5252 73.9897 9.1310 37.0162 51.5624 136.9594 29.4820 26.9527 37.1150 96.5355 18.8245 23.3813 9.3562 55.7456 4.1922 23.8998 31.2470 2.7928 3.7679 14.5946 57.1890 2.8823 2.7975 61.5548 20.6384 30.6438 76.2116 11.1136 5.8098 58.8136 13.5700 61.0366 99.6474 18.3603 12.5573 25.7825 29.0984 272.9584 13.9460 12.9226 33.1367 8.5361 18.8270 8.4464 3.9005 17.9295 19.6588 7.6460 1.9352 0.9151 116.6586 27.3371 22.6220 7.7734
temp: 298.150 k
press: 1.00000 atm
elementType: 17 17 8 8 8 8 8 6 6 6 6 6 6 6 6 6 6 6 6 6 1 1 1 1 1 1 1 1 1 1 1 1 1 1 1 1
symmnumber: 1
zpe: 717764.8 jmol-1
zpe.correction: 0.273382 hartree
zpe.thermalcorrener: 0.294284 hartree
zpe.thermalcorrenthalpy: 0.295228 hartree
zpe.thermalcorrgfe: 0.220791 hartree
zpe.sumelectzpe: -1799.694083 hartree
zpe.sumelectthermal: -1799.673182 hartree
zpe.sumelectthermalent: -1799.672237 hartree
zpe.sumelectthermalfe: -1799.746674 hartree
dipole: 0.4388 -0.0867 0.8949
dipole: 1.0005
quadrupole: -150.3037 -127.4443 -128.4589
quadrupole: -9.2005 -6.1556 -0.7756
quadrupole: -14.9014 7.9580 6.9434 -9.2005 -6.1556 -0.7756
hfenergy: -1799.9674652 hartree
pointgroup: C01 [X(C13H16Cl2O5)]
dipole: -0.2502277 0.3029778 0.0229655 debye
polarizability: 230.1665822|33.8337682|142.7109965|-14.343218|15.1479558|155.1651186 unknown
InChI: InChI=1S/C13H16Cl2O5/c14-8-3-1-7(9(15)5-8)2-4-10(16)13(20)11(17)6-12(18)19/h1,3,5,10-11,13,16-18,20H,2,4,6H2
charge 0 multiplicity 1
36 atoms
Cl -1.722455 1.056038 2.092393
Cl -6.333829 -1.889038 1.245408
O  0.983716 1.961976 -2.667813
O  3.209932 1.894609 -1.340931
O  3.72883 -0.713219 -1.526484
O  4.062284 0.270266 3.22315
O  1.94726 -0.075103 2.341836
C  1.05283 0.767659 -1.769538
C  2.190182 1.018655 -0.732152
C  -0.339067 0.511527 -1.163578
C  2.965458 -0.273905 -0.358107
C  -0.438232 -0.715702 -0.210552
C  3.914346 -0.04379 0.839348
C  -1.879863 -1.000569 0.174771
C  3.182965 0.043057 2.160085
C  -2.57599 -0.274894 1.172568
C  -2.615641 -2.019192 -0.487866
C  -3.919464 -0.524104 1.516129
C  -3.963951 -2.302987 -0.180568
C  -4.595972 -1.545215 0.822853
H  1.357669 -0.051737 -2.444068
H  1.776475 1.500978 0.175836
H  -0.659636 1.415662 -0.603544
H  -1.04939 0.370945 -2.001022
H  2.268886 -1.093961 -0.124942
H  -0.023231 -1.604043 -0.723548
H  0.169518 -0.533248 0.694693
H  4.636873 -0.879343 0.891277
H  4.5087 0.877411 0.691392
H  0.295712 2.585975 -2.320148
H  2.729029 2.38078 -2.074104
H  4.099668 0.129097 -1.917019
H  -2.112213 -2.60808 -1.263147
H  -4.416475 0.056629 2.296713
H  -4.505722 -3.094713 -0.704787
H  3.546001 0.313378 4.074266
