program: Gaussian 09
title: 000197418
version: EM64L-G09RevD.01
frameworkgroup: C1[X(C7H11NO2)]
method: RPBEPBE
basis: SDD
operation: Freq
keyword: #p
keyword: freq=noraman
keyword: PBEPBE/SDD
title: #p freq=noraman PBEPBE/SDD
converged: NO NO NO NO
title: Mulliken charges:
elementType: O O N C C C C C C C H H H H H H H H H H H
charge: -0.201545 -0.430981 -0.112299 -0.058223 -0.116012 -0.501033 -0.455895 -0.569030 0.131388 -0.385218 0.251570 0.241794 0.218569 0.237001 0.264447 0.233174 0.242341 0.251879 0.218418 0.204517 0.335139
chargesum: 0.00000
title: Mulliken charges with hydrogens summed into heavy atoms:
elementType: O O N C C C C C C C
charge: -0.201545 -0.095842 -0.112299 0.193347 0.125781 -0.045463 0.041725 -0.074810 0.131388 0.037717
polarizability: 9.53822929e+01 1.40516284e+00 8.56366436e+01 6.41802429e+00 2.84471345e+00 6.78127728e+01
1716.lowfreq: -16.2746 -12.8101 -10.2834 0.0004 0.0007 0.0009 51.0242 88.9257 122.6674
frequency: 50.9687 88.9126 122.6630 176.2074 216.5092 292.6140 302.3470 400.1709 419.7247 445.9234 517.8788 583.8980 615.9201 706.6867 772.4014 803.8419 826.4059 867.3186 891.4789 951.6916 960.2689 984.3770 1020.6431 1035.1669 1042.3550 1068.6529 1091.4039 1119.2020 1145.9258 1171.4275 1195.0508 1206.3733 1243.2217 1256.0397 1272.7497 1288.8473 1297.9237 1320.6743 1327.1568 1355.0520 1372.9589 1430.9234 1465.0067 1468.5423 1476.0550 1720.9308 2955.7295 2973.4650 3001.0599 3011.6963 3037.0861 3052.1818 3059.8039 3071.3181 3106.5060 3112.3780 3564.8792
redmass: 4.2199 3.6779 3.2349 2.8905 2.9925 1.1463 3.1547 2.7777 2.1245 3.3440 2.5873 3.9857 5.0764 3.2982 4.2665 2.6040 3.4420 1.5752 1.7623 2.3672 4.0997 2.1147 4.2261 1.4276 2.6207 1.8221 2.0556 1.7112 1.2754 1.5329 1.5702 2.4278 1.4520 1.3984 1.5667 1.1451 1.5280 1.3410 1.4548 1.4333 1.2464 1.1081 1.0821 1.0807 1.0877 12.1529 1.0677 1.0834 1.0628 1.0663 1.0605 1.0891 1.0975 1.1008 1.1000 1.1060 1.0663
irintensity: 2.6686 2.5810 4.6990 7.2620 8.3408 156.5281 1.1454 4.0077 22.5459 5.1748 6.1593 9.2927 4.4874 3.4653 2.9501 12.5566 0.4163 1.2147 20.8149 30.0423 60.4259 3.5871 46.7991 2.9136 12.4936 15.4333 4.5031 5.7754 7.2219 8.8887 20.7226 49.0288 20.7423 15.2829 33.5027 0.9346 14.9736 11.3602 21.3276 7.7908 19.4727 12.0618 10.9548 11.2617 2.6181 442.6112 60.1378 13.2945 32.9520 36.8681 13.7470 34.7084 14.6819 42.9170 9.2048 16.9869 7.5649
temp: 298.150 k
press: 1.00000 atm
elementType: 8 8 7 6 6 6 6 6 6 6 1 1 1 1 1 1 1 1 1 1 1
symmnumber: 1
zpe: 456594.2 jmol-1
zpe.correction: 0.173908 hartree
zpe.thermalcorrener: 0.183363 hartree
zpe.thermalcorrenthalpy: 0.184307 hartree
zpe.thermalcorrgfe: 0.138769 hartree
zpe.sumelectzpe: -477.729305 hartree
zpe.sumelectthermal: -477.719850 hartree
zpe.sumelectthermalent: -477.718905 hartree
zpe.sumelectthermalfe: -477.764443 hartree
dipole: 1.6007 4.2571 -1.2671
dipole: 4.7213
quadrupole: -71.3754 -62.5937 -57.2423
quadrupole: -7.0965 -5.3501 1.0755
quadrupole: -7.6383 1.1435 6.4948 -7.0965 -5.3501 1.0755
hfenergy: -477.9032123 hartree
pointgroup: C01 [X(C7H11N1O2)]
dipole: -0.72445 -1.7080591 -0.0894894 debye
dipolederiv: -0.6564668 -0.182885 0.2085191 -0.4977711 -0.9073641 0.350912 0.4063291 0.304029 -0.5743963 -0.8072124 0.1159426 -0.1922754 0.1693733 -0.6523618 0.0966463 -0.2101074 0.1134407 -0.1769661 -0.894862 -0.0967114 0.2706613 -0.0151031 -0.3947224 -0.0787739 0.5420877 0.0459801 -0.7198901 0.1541518 0.0327504 0.0831258 0.1796069 0.2964838 -0.1082711 0.0953734 -0.0867317 0.2929897 -0.1881756 0.0748294 -0.036411 -0.0215658 -0.0301356 -0.0316034 0.0269066 -0.0334196 0.1148607 -0.1124374 0.0301785 -0.0811876 0.0022606 -0.0044147 0.0150837 -0.1115815 -0.0137563 0.0767615 0.4497813 -0.0649425 -0.0448692 -0.1498526 0.1009966 0.0913686 -0.0520839 0.0397451 0.280861 -0.0218944 0.0287179 0.1082574 0.0493988 -0.3867829 0.0436289 0.0684747 0.0353821 0.088387 1.0636794 0.2416642 -0.6541674 0.4187562 1.1376191 -0.3407232 -0.9610023 -0.4141801 0.7345438 0.5525009 -0.1396523 0.1072453 -0.1401171 0.5451703 -0.0668748 0.0703131 -0.0942769 0.3065754 0.0016099 0.0009909 -0.0177654 -0.0096759 -0.0074918 0.0791958 -0.044682 0.1154134 -0.1152172 0.024925 -0.000649 0.0450214 -0.0237077 0.0210793 0.0379326 0.0069864 0.0405664 -0.1444821 -0.0333603 -0.0930416 0.0835342 -0.0522469 0.0212958 0.0505554 0.0828235 0.0993702 -0.0338482 0.0592201 0.0220517 0.0213182 -0.0012512 -0.0310514 -0.0765238 -0.010742 -0.1342932 -0.0349806 0.0654753 -0.0141597 0.0111413 0.0263671 -0.0428955 0.0371376 -0.0177319 0.0867221 0.0701566 -0.0514557 0.0393969 0.0884982 0.0004694 0.0719287 0.0001416 0.0918867 -0.0476937 -0.0869712 0.1065937 -0.0330331 -0.0465269 0.0102205 0.0488476 -0.0553086 0.0030748 -0.0756922 -0.0507216 -0.093624 0.0607826 -0.0514557 0.0666529 0.0667076 0.0093734 -0.0727913 0.0537066 0.0701958 0.0562576 0.0191638 0.0019529 0.0285397 0.0367724 0.0298025 0.0534692 0.0683348 -0.123955 -0.0575669 -0.0378403 -0.051585 -0.0601268 -0.1639687 -0.0694509 -0.0798955 -0.1143983 0.0010765 0.3828604 -0.003554 0.1469684 0.0197728 0.274288 -0.0142488 0.1128925 0.0117514 0.0250205 unknown
polarizability: 95.5895679|-0.7502339|83.291019|-6.4230433|-6.361956|69.9511223 unknown
InChI: InChI=1S/C7H11NO2/c9-4-5-1-6-2-7(10)8(6)3-5/h5-6,9H,1-4H2
charge 0 multiplicity 1
21 atoms
O  2.414999 1.463265 -0.940111
O  -3.373291 1.047609 -0.551717
N  0.864558 0.412263 0.618027
C  0.887067 -1.099487 0.631254
C  -1.199348 -0.178291 -0.394753
C  -0.490824 -1.515446 0.030393
C  -0.500928 0.942013 0.451917
C  2.175083 -1.044396 -0.267097
C  1.942688 0.500048 -0.306544
C  -2.723178 -0.226889 -0.207574
H  1.04873 -1.5255 1.634518
H  -0.970337 0.021046 -1.462632
H  -1.092134 -2.035257 0.80047
H  -0.38412 -2.205955 -0.824102
H  -0.479196 1.92166 -0.049783
H  -0.995191 1.063372 1.43373
H  2.080655 -1.516838 -1.258671
H  3.113977 -1.370547 0.208216
H  -2.97229 -0.379372 0.85769
H  -3.162012 -1.065002 -0.790765
H  -3.225407 1.238206 -1.512368
