program: Gaussian 09
title: 000197408
version: EM64L-G09RevD.01
frameworkgroup: C1[X(C10F18O4)]
method: RPBEPBE
basis: SDD
operation: Freq
keyword: #pfreq=noraman
keyword: PBEPBE/SDD
title: #p freq=noraman PBEPBE/SDD
converged: YES YES NO NO
title: Mulliken charges:
elementType: F F F F F F F F F F F F F F F F F F O O O O C C C C C C C C C C
charge: -0.103112 -0.103108 -0.097627 -0.109452 -0.097623 -0.109448 -0.113936 -0.113723 -0.112554 -0.113382 -0.113157 -0.112866 -0.112865 -0.113156 -0.113381 -0.112551 -0.113725 -0.113934 -0.196351 -0.196396 -0.172823 -0.172836 0.141914 0.141916 0.086585 0.086620 0.301344 0.301361 0.424520 0.404624 0.404632 0.424490
chargesum: 0.00000
title: Mulliken charges with hydrogens summed into heavy atoms:
polarizability: 1.55962647e+02 5.21958811e+00 1.13938099e+02 6.06416188e+00 3.15139100e+00 1.14766503e+02
1716.lowfreq: -9.9991 -5.0367 -0.0008 -0.0006 0.0001 1.6998 17.7161 22.0355 24.6360
frequency: 17.7161 22.0355 24.5244 27.4660 32.6156 33.1332 57.9468 59.9888 62.3176 73.2296 101.1968 133.5415 142.7412 153.8428 156.0366 164.9122 174.7391 200.4305 205.1058 222.1446 235.2063 243.8643 246.1685 264.1885 264.7564 268.9013 272.0251 285.2803 286.8350 301.6130 302.9517 307.8418 343.3628 364.5469 378.7756 394.9681 395.0610 449.4861 454.9272 460.0905 460.6357 467.5850 476.2524 486.1332 486.4327 496.0651 503.6549 520.7389 533.8117 571.9286 602.2356 624.3156 625.0818 649.3795 653.7796 663.4958 665.6598 685.3520 732.6083 762.8028 851.6222 893.0913 895.8286 906.4623 947.0902 983.8259 990.1097 1005.8100 1009.6182 1025.5263 1025.6444 1029.1842 1035.7263 1038.5511 1038.9624 1039.3076 1043.2086 1067.3242 1079.4654 1097.7408 1099.1696 1106.2536 1109.4621 1133.3150 1160.2915 1187.5391 1187.9204 1195.5513 1224.1522 1253.3824
redmass: 18.0737 17.7318 18.8544 18.5940 18.3575 17.8475 17.5009 18.6774 18.5638 18.1752 17.8676 18.1130 17.9521 17.8121 18.1372 17.7720 17.4223 17.5578 18.1122 17.8068 17.9109 18.3831 18.1325 18.3131 18.2215 18.3433 18.0581 18.1170 18.1713 18.3052 18.3972 17.7928 17.6031 16.7968 17.0515 16.8673 16.7666 16.9923 17.2386 17.7363 17.6936 17.2330 17.1767 17.7758 17.7187 17.0371 17.2730 16.9400 16.9415 17.6477 15.4254 16.6909 16.6431 16.9080 17.4012 16.5056 16.1806 15.1186 15.5743 16.1510 14.2167 14.0445 14.0850 13.3536 12.9638 13.0512 13.2424 13.0411 12.8873 13.1282 13.0594 13.1230 12.7504 13.1417 13.3640 13.1099 13.2541 13.2248 12.8300 12.9784 12.9671 12.9392 12.9366 12.7921 12.5360 12.2374 12.2389 12.3476 12.3840 12.1737
irintensity: 0.0116 0.0012 0.0000 0.0118 0.0000 0.0509 0.0000 0.0000 0.0633 0.0338 0.0000 3.2087 0.0000 0.5149 0.0001 4.5350 0.0000 3.0211 0.0000 0.0000 3.3756 3.6143 0.0000 0.0000 0.2232 0.0000 2.1584 2.7791 0.0000 0.9260 0.0000 0.0000 1.3808 13.6581 0.0000 0.0257 7.9538 0.0000 28.1254 0.0001 8.7728 0.0000 8.2499 0.0000 0.1923 0.0000 0.6551 0.0000 12.8384 0.0000 5.7267 0.0000 79.8686 60.8742 0.0000 6.2891 0.0000 0.0000 30.9224 0.0000 52.6581 0.0001 272.8573 0.0000 213.2598 0.0001 124.0865 0.0001 70.3810 0.0001 133.2346 0.0006 53.0339 0.0341 526.2249 0.0232 427.1065 437.6012 0.0001 0.0006 764.8325 822.2020 0.0001 182.7483 0.0000 0.0110 230.6032 0.0002 32.9477 0.0000
temp: 298.150 k
press: 1.00000 atm
elementType: 9 9 9 9 9 9 9 9 9 9 9 9 9 9 9 9 9 9 8 8 8 8 6 6 6 6 6 6 6 6 6 6
symmnumber: 1
zpe: 310524.2 jmol-1
zpe.correction: 0.118272 hartree
zpe.thermalcorrener: 0.148245 hartree
zpe.thermalcorrenthalpy: 0.149189 hartree
zpe.thermalcorrgfe: 0.054227 hartree
zpe.sumelectzpe: -2476.587238 hartree
zpe.sumelectthermal: -2476.557266 hartree
zpe.sumelectthermalent: -2476.556322 hartree
zpe.sumelectthermalfe: -2476.651283 hartree
dipole: -0.0002 0.0001 -0.0002
dipole: 0.0003
quadrupole: -179.5672 -182.7564 -182.7076
quadrupole: 0.2326 0.3944 -0.0800
quadrupole: 2.1099 -1.0794 -1.0305 0.2326 0.3944 -0.0800
hfenergy: -2476.7055105 hartree
pointgroup: C01 [X(C10F18O4)]
dipole: 0.0000583 -0.0000795 -0.0000395 debye
polarizability: 156.0804797|-0.098029|111.2893967|-7.722998|-0.7274984|117.2973724 unknown
InChI: InChI=1S/C10F18O4/c11-1(9(25,26)31-3(29-1,5(13,14)15)6(16,17)18)2(12)10(27,28)32-4(30-2,7(19,20)21)8(22,23)24
charge 0 multiplicity 1
32 atoms
F  -0.23726 1.650915 -0.732766
F  0.236894 -1.650278 0.734471
F  -0.887461 0.281588 -2.818366
F  -0.722853 -1.71283 -1.802645
F  0.888022 -0.279904 2.819031
F  0.723629 1.713937 1.802105
F  -4.159704 1.823204 1.036789
F  -3.110711 2.309145 -0.917638
F  -5.012378 1.072729 -0.929177
F  -4.823699 -1.527717 0.0724
F  -2.750208 -2.255289 0.638557
F  -3.854348 -0.811058 1.997267
F  3.853411 0.809706 -1.998138
F  2.750025 2.254669 -0.639595
F  4.823703 1.527133 -0.074018
F  5.012744 -1.072535 0.928611
F  3.111063 -2.308909 0.919023
F  4.158929 -1.82433 -1.036342
O  -1.69819 0.3565 0.58116
O  1.697855 -0.35701 -0.58066
O  -2.618286 -0.405359 -1.459565
O  2.618679 0.405833 1.459352
C  -0.610149 0.330876 -0.35019
C  0.610066 -0.330587 0.35097
C  -2.947649 0.03391 -0.114777
C  2.947579 -0.034182 0.114694
C  -1.192773 -0.400358 -1.641694
C  1.193211 0.401255 1.641872
C  -3.831226 1.326201 -0.227527
C  -3.61361 -1.153574 0.663749
C  3.613313 1.15286 -0.66467
C  3.831179 -1.326443 0.227817
