program: Gaussian 09
title: 000197333
version: EM64L-G09RevD.01
frameworkgroup: C1[X(C6H8O3)]
method: RPBEPBE
basis: SDD
operation: Freq
keyword: #p
keyword: freq=noraman
keyword: PBEPBE/SDD
title: #p freq=noraman PBEPBE/SDD
converged: YES YES NO NO
title: Mulliken charges:
elementType: O O O C C C C C C H H H H H H H H
charge: -0.294502 -0.424621 -0.255049 -0.030092 -0.143854 -0.690024 -0.135672 -0.293110 0.172464 0.241515 0.229819 0.222125 0.233039 0.237213 0.263566 0.289262 0.377921
chargesum: 0.00000
title: Mulliken charges with hydrogens summed into heavy atoms:
elementType: O O O C C C C C C
charge: -0.294502 -0.046700 -0.255049 0.211423 0.085964 0.002354 0.127894 -0.003849 0.172464
polarizability: 1.19214526e+02 -4.32503410e+00 6.80075647e+01 3.16356966e-01 -2.54224451e+00 4.95282207e+01
1716.lowfreq: -11.6990 0.0001 0.0004 0.0007 4.0265 5.0748 52.9908 86.7232 107.0543
frequency: 52.9797 86.7209 107.0536 161.3838 192.2181 218.1272 262.3935 331.7478 426.4870 463.0422 554.0118 592.2267 648.3338 690.1260 694.8889 785.6686 870.6795 899.7912 937.2158 998.5480 1002.5817 1029.7387 1038.1389 1078.1365 1123.8991 1138.6555 1211.1723 1227.8837 1278.3929 1312.2582 1333.6111 1391.3944 1404.3613 1458.8200 1471.6856 1636.3512 1661.5936 2987.1518 3078.3708 3079.6617 3084.7477 3105.4767 3113.6006 3174.3253 3522.9962
redmass: 5.3549 4.6281 4.3370 2.8994 1.1001 6.0322 3.5346 2.3762 3.8306 3.6437 6.4578 1.3181 4.1231 3.9580 4.6415 4.9733 2.3689 1.7144 4.2283 1.1462 1.5375 1.3478 1.9875 1.7105 1.4717 2.1187 1.4099 1.4995 1.3482 1.3334 2.2522 1.4097 2.0018 1.0712 1.0566 8.5085 6.3866 1.0362 1.0919 1.0959 1.0917 1.0966 1.0918 1.0925 1.0640
irintensity: 4.6079 0.6549 3.9161 1.1817 0.3267 0.6102 0.4092 2.7650 22.8922 15.3800 36.3045 100.7852 15.8170 28.4618 33.0866 32.1606 14.8097 8.2939 11.3716 71.9918 37.8636 43.6700 164.7546 127.6234 1.4190 12.0718 33.4691 2.9577 19.1830 14.8676 93.3086 5.9151 39.2422 10.5893 13.0908 271.6607 101.7080 19.0102 5.6818 22.7013 7.8573 39.4360 5.6372 0.8573 42.3095
temp: 298.150 k
press: 1.00000 atm
elementType: 8 8 8 6 6 6 6 6 6 1 1 1 1 1 1 1 1
symmnumber: 1
zpe: 340449.1 jmol-1
zpe.correction: 0.129670 hartree
zpe.thermalcorrener: 0.139198 hartree
zpe.thermalcorrenthalpy: 0.140142 hartree
zpe.thermalcorrgfe: 0.094345 hartree
zpe.sumelectzpe: -458.365221 hartree
zpe.sumelectthermal: -458.355693 hartree
zpe.sumelectthermalent: -458.354749 hartree
zpe.sumelectthermalfe: -458.400545 hartree
dipole: -2.1234 0.8225 1.2139
dipole: 2.5805
quadrupole: -44.3932 -57.5969 -52.6217
quadrupole: -9.2421 -2.2300 -3.4168
quadrupole: 7.1441 -6.0596 -1.0845 -9.2421 -2.2300 -3.4168
hfenergy: -458.4948908 hartree
pointgroup: C01 [X(C6H8O3)]
dipole: -0.8479065 -0.4992776 -0.249975 debye
dipolederiv: -0.5325353 -0.0230382 0.0011771 0.1780186 -0.6264855 -0.0637641 0.0322254 -0.0524749 -0.2994771 -0.7878924 -0.4835061 0.2911563 -0.4847045 -0.7295742 0.2443358 0.3314254 0.270267 -0.6309329 -0.8854784 0.2269607 -0.0245714 0.2841931 -0.8038729 0.1981293 -0.0143422 0.1818217 -0.4303669 0.6063114 0.0814616 0.0186804 -0.06114 0.2790921 0.0958745 0.2768484 0.0309715 0.2696683 -0.153395 0.0020824 -0.0949755 -0.1280519 0.1971118 -0.0268263 -0.4056832 0.0087964 0.2391351 -0.2239713 -0.0700201 0.0147792 0.0511253 0.0434491 -0.0139164 -0.1012286 -0.0100037 0.0186854 0.5755324 -0.0177524 -0.0216007 0.1051592 0.0418606 -0.127942 -0.1798889 -0.0806067 -0.1227222 -0.9312751 -0.0476001 0.0951098 -0.1708954 -0.0260345 -0.0455167 0.2871868 -0.052494 -0.1599157 1.93546 0.1284894 -0.355788 -0.0808149 1.1377109 -0.448103 -0.3426876 -0.4896398 0.5727591 -0.0255756 -0.0094866 0.0802373 -0.0313453 0.065265 -0.0361113 0.0483939 -0.0575769 -0.0815011 -0.0123399 -0.0043675 0.0868295 0.0745808 0.0525262 0.0720738 0.0950369 0.0772696 -0.0484911 0.0575427 -0.0250712 -0.0183841 -0.0742458 -0.1167143 -0.0605087 0.0020129 -0.0539025 0.101192 0.0713284 -0.0070483 0.019704 0.009948 0.1036281 -0.038998 0.1007369 -0.0296177 -0.0995147 -0.060637 0.032068 -0.0753381 0.074684 0.038022 0.0901325 -0.0691472 0.0907905 0.0179147 0.0661334 0.0575933 -0.0135701 0.0378113 0.0267913 0.0730295 -0.0130548 0.0720711 0.1266068 0.0893075 0.0445642 0.006253 0.056246 0.0488747 0.0577423 -0.0085503 0.0552173 0.1434936 0.2114842 0.1146708 -0.0096986 0.1594316 0.2683497 0.0303688 -0.0392838 0.0391112 0.3834666 unknown
polarizability: 118.9265994|3.236126|62.3815332|-4.9286073|-9.0100075|55.442179 unknown
InChI: InChI=1S/C6H8O3/c1-4-5(9-4)2-3-6(7)8/h2-5,7H,1H3
charge 0 multiplicity 1
17 atoms
O  -1.840847 1.182697 0.364771
O  3.108949 0.882443 -0.752946
O  2.89398 -1.16219 0.338678
C  -2.321646 -0.078631 -0.31383
C  -1.377742 -0.16382 0.870535
C  -3.794836 -0.394481 -0.190331
C  0.058199 -0.489773 0.704608
C  0.954033 0.313485 0.064917
C  2.366268 -0.097945 -0.072033
H  -1.863038 -0.220927 -1.302927
H  -1.831782 -0.449174 1.830565
H  -3.987332 -1.455862 -0.434455
H  -4.153703 -0.196117 0.834141
H  -4.384099 0.229388 -0.886224
H  0.407496 -1.441155 1.131261
H  0.656241 1.282933 -0.344887
H  4.05386 0.57803 -0.825444
