program: Gaussian 09
title: 000197322
version: EM64L-G09RevD.01
frameworkgroup: C1[X(C15H16ClNO3)]
method: RPBEPBE
basis: SDD
operation: Freq
keyword: #p
keyword: freq=noraman
keyword: PBEPBE/SDD
title: #p freq=noraman PBEPBE/SDD
converged: YES YES NO NO
title: Mulliken charges:
elementType: Cl O O O N C C C C C C C C C C C C C C C H H H H H H H H H H H H H H H H
charge: -0.049103 -0.262793 -0.230902 -0.233953 -0.502102 -0.102656 -0.278619 -0.613501 0.461682 -0.726155 0.151249 -0.518311 0.218131 0.476490 -0.428926 -0.348264 -0.502191 -0.181786 -0.204264 -0.122223 0.220632 0.271036 0.226179 0.251142 0.195953 0.280820 0.224793 0.271009 0.307497 0.238456 0.272083 0.251780 0.236194 0.231546 0.258584 0.260492
chargesum: 0.00000
title: Mulliken charges with hydrogens summed into heavy atoms:
elementType: Cl O O O N C C C C C C C C C C C C C C C
charge: -0.049103 -0.262793 -0.230902 -0.233953 -0.194605 0.117977 -0.007583 -0.136180 0.461682 -0.024589 0.151249 -0.247303 0.218131 0.476490 -0.190469 -0.076181 0.217330 0.076798 0.056228 -0.122223
polarizability: 3.20313239e+02 -7.96222532e+00 1.67817668e+02 1.96995595e+00 -1.65399555e+01 1.25495621e+02
1716.lowfreq: -0.0012 0.0012 0.0018 3.9221 6.3243 12.8528 21.4881 32.3081 37.1527
frequency: 21.4238 32.2684 37.0705 50.0953 80.3916 85.3099 98.4753 131.7420 150.9968 155.9877 188.7684 200.3021 215.6425 221.2999 232.2116 281.8591 297.6253 309.6324 327.7937 353.3543 371.2072 411.9567 450.9918 474.4917 490.9899 501.6086 523.0094 551.1684 567.5335 600.8755 622.3913 647.7371 668.2537 693.1581 706.6922 751.2099 804.6341 810.2025 826.8582 829.4003 859.4036 880.3662 892.5810 901.1920 921.3103 942.0859 963.3374 979.7696 994.3440 1015.7106 1062.7833 1076.4534 1081.5472 1112.3405 1114.3747 1118.3428 1134.0610 1150.2917 1187.1821 1190.0936 1224.3020 1232.0489 1247.7487 1265.7127 1277.6213 1304.9190 1306.4583 1323.2609 1348.7413 1355.8561 1383.0765 1398.1614 1406.2471 1421.0108 1447.4942 1452.1236 1463.6398 1473.4148 1481.7647 1496.1639 1515.1697 1567.5399 1593.3699 1605.8318 1628.9926 1648.7309 2955.5060 2982.2704 2986.4012 2997.0690 3005.5524 3015.2622 3075.2693 3108.8718 3111.7058 3130.1874 3149.9357 3164.3883 3173.6828 3177.6517 3189.3208 3521.1420
redmass: 6.8218 6.1293 4.8303 4.8054 6.7475 2.2663 1.4369 4.6863 5.6644 4.0374 4.6542 5.5136 1.1965 4.2993 5.7002 3.3244 5.5829 3.6448 5.4691 3.6296 3.2745 2.9901 6.3153 5.1467 4.3589 3.0653 2.6193 2.1174 1.9610 5.8107 6.4893 7.1940 5.8885 4.3965 3.9264 5.1156 3.5663 1.5762 1.6723 2.5051 2.1525 2.5568 2.2231 2.8144 2.7853 1.3454 1.3380 2.1240 3.9524 3.0904 1.5732 2.7580 2.3212 1.3617 1.4490 1.3504 2.3779 1.4570 1.2192 1.9238 1.9398 1.4913 1.8032 1.3434 1.8297 1.3533 2.4275 2.4249 1.4802 1.9291 3.4097 1.2139 3.4893 1.1876 1.0933 1.0498 1.0502 1.0512 2.4470 1.0532 2.0600 9.5335 5.5838 5.7559 4.8959 8.9478 1.0606 1.0791 1.0406 1.0841 1.0294 1.0994 1.0988 1.1045 1.0981 1.0901 1.1048 1.0896 1.0953 1.0922 1.0947 1.0755
irintensity: 1.0458 0.5826 1.9026 0.2190 4.2169 0.9536 0.1412 3.5204 0.9288 1.0415 1.2635 0.5158 0.8249 2.7350 1.9150 13.6170 0.2979 1.2091 12.5935 0.6338 2.3202 0.6063 19.0625 13.8159 5.3159 55.4828 13.7792 48.0154 31.0857 17.5052 4.9744 5.5461 3.8441 5.4226 7.0834 4.2390 15.3199 5.6521 45.9804 33.5639 14.6913 16.2549 6.4621 18.2579 14.3745 0.1267 1.5469 0.8233 34.8164 67.2474 2.1126 65.9985 135.1054 4.6797 14.2312 16.9139 171.2874 21.8648 34.9793 31.4683 145.7583 8.3353 67.3201 4.9471 24.5663 8.6360 74.4800 67.6244 4.6926 48.0801 38.0718 32.3632 21.4197 19.8981 13.0523 13.8816 11.7420 8.7692 187.9506 6.9007 476.0507 217.2396 61.2600 30.3704 377.7201 162.8084 25.3639 13.7651 29.1839 32.3667 39.6669 26.4479 36.5840 22.8044 7.0995 10.1900 17.3109 4.0051 5.2516 7.3280 0.3883 29.3023
temp: 298.150 k
press: 1.00000 atm
elementType: 17 8 8 8 7 6 6 6 6 6 6 6 6 6 6 6 6 6 6 6 1 1 1 1 1 1 1 1 1 1 1 1 1 1 1 1
symmnumber: 1
zpe: 735510.8 jmol-1
zpe.correction: 0.280141 hartree
zpe.thermalcorrener: 0.299666 hartree
zpe.thermalcorrenthalpy: 0.300610 hartree
zpe.thermalcorrgfe: 0.230097 hartree
zpe.sumelectzpe: -1320.210970 hartree
zpe.sumelectthermal: -1320.191445 hartree
zpe.sumelectthermalent: -1320.190501 hartree
zpe.sumelectthermalfe: -1320.261014 hartree
dipole: -1.0112 5.7731 -2.3239
dipole: 6.3049
quadrupole: -129.4314 -119.0325 -126.3957
quadrupole: -2.3438 -6.5046 -5.6741
quadrupole: -4.4782 5.9207 -1.4425 -2.3438 -6.5046 -5.6741
hfenergy: -1320.4911112 hartree
pointgroup: C01 [X(C15H16Cl1N1O3)]
dipole: 0.544051 -2.3995336 -0.3152479 debye
polarizability: 320.0175013|2.0362999|172.8587209|-12.0744017|3.3419347|120.7503054 unknown
InChI: InChI=1S/C15H16ClNO3/c1-9-7-12(8-13(18)14(9)15(19)20-2)17-11-5-3-10(16)4-6-11/h3-6,8-9,14,17H,7H2,1-2H3
charge 0 multiplicity 1
36 atoms
Cl 6.674776 1.670015 -0.466757
O  -4.918522 0.222578 -0.85939
O  -2.180316 1.898952 -0.367049
O  -4.605634 0.296447 1.44332
N  1.429468 -1.336808 -0.006838
C  -2.219512 -1.585603 0.87295
C  -2.779538 -0.476111 -0.067446
C  -0.88527 -2.074781 0.248331
C  0.09567 -0.932247 0.003156
C  -2.035997 -1.150828 2.345929
C  -1.774812 0.704841 -0.212199
C  -0.356315 0.357796 -0.216558
C  -4.16232 0.044108 0.300603
C  2.626449 -0.574121 -0.12691
C  3.749777 -1.196761 -0.736391
C  2.763506 0.740075 0.394653
C  -6.243679 0.859643 -0.666964
C  4.98414 -0.524415 -0.835076
C  3.993739 1.422023 0.287041
C  5.088485 0.785647 -0.328152
H  -2.929693 -2.436391 0.851516
H  -2.871399 -0.905858 -1.086581
H  -0.4240 -2.827049 0.918926
H  -1.093705 -2.581735 -0.717424
H  -1.66796 -2.002432 2.948332
H  -2.992545 -0.805117 2.767763
H  -1.308914 -0.324515 2.439989
H  0.321493 1.186511 -0.433824
H  1.573208 -2.348847 0.029331
H  3.656446 -2.208595 -1.148649
H  1.934096 1.221718 0.91696
H  -6.114075 1.863565 -0.23011
H  -6.871158 0.247787 0.003009
H  -6.675827 0.918449 -1.675546
H  5.843706 -1.00745 -1.307958
H  4.097328 2.432608 0.692113
