program: Gaussian 09
title: 000197289
version: EM64L-G09RevD.01
frameworkgroup: C1[X(C15H19NO2)]
method: RPBEPBE
basis: SDD
operation: Freq
keyword: #p
keyword: freq=noraman
keyword: PBEPBE/SDD
title: #p freq=noraman PBEPBE/SDD
converged: YES YES NO NO
title: Mulliken charges:
elementType: O O N C C C C C C C C C C C C C C C H H H H H H H H H H H H H H H H H H H
charge: -0.445908 -0.437314 -0.415753 0.224107 -0.594480 -0.317991 -0.384163 -0.747391 0.373158 0.179511 0.400861 -0.389801 -0.400135 -0.453172 -0.262885 -0.427176 -0.258780 -0.242543 0.282469 0.238775 0.245047 0.173384 0.227574 0.195857 0.250922 0.258488 0.208398 0.205250 0.218839 0.226822 0.240824 0.228429 0.363921 0.333717 0.239038 0.230656 0.231446
chargesum: 0.00000
title: Mulliken charges with hydrogens summed into heavy atoms:
elementType: O O N C C C C C C C C C C C C C C C
charge: -0.081987 -0.103597 -0.133284 0.224107 -0.110658 0.082966 0.062617 -0.075255 0.373158 0.179511 0.400861 -0.170962 -0.173313 -0.212348 -0.034456 -0.188138 -0.028124 -0.011098
polarizability: 2.04219696e+02 1.62673320e+01 1.99915865e+02 -2.11455498e+01 9.26133994e+00 1.20968321e+02
1716.lowfreq: -19.6509 -8.0401 -5.2602 0.0002 0.0004 0.0005 9.2095 21.9484 44.9907
frequency: -11.0119 21.3890 44.9606 78.7195 98.4369 110.0670 157.5900 169.8527 175.4303 185.4332 230.8878 245.5151 286.0506 292.0025 311.8053 340.3525 383.6532 411.8727 416.0834 445.3626 468.7924 475.0758 492.8309 513.5737 533.4610 552.4221 598.9898 618.1111 648.9720 681.1802 709.2934 737.1114 748.1029 784.5703 791.9472 810.3427 848.0177 869.1729 882.9663 890.0133 913.8486 939.2604 953.6604 959.8563 963.9635 980.7662 982.2637 993.5999 1001.2597 1016.9654 1035.7843 1079.9308 1084.3843 1108.5439 1132.8154 1152.4334 1174.0493 1178.2702 1184.9490 1210.5420 1222.1402 1236.5178 1238.2672 1265.1508 1285.5654 1300.4521 1324.5540 1335.1751 1373.1149 1378.1417 1383.1165 1392.9875 1403.3539 1412.9490 1440.2223 1448.0873 1454.9547 1458.1718 1465.0495 1472.1681 1483.9361 1491.4888 1519.1527 1587.4524 1598.4453 1631.9290 2935.4356 2958.3009 2971.9405 2982.6553 3064.4128 3081.3356 3083.9291 3087.4440 3089.1743 3104.3852 3122.0976 3126.3207 3133.5842 3149.1400 3154.0202 3165.3161 3277.5299 3475.4239 3571.1868
redmass: 4.5592 4.8410 4.3578 2.8190 4.3168 4.0730 3.4475 2.9631 2.7137 1.4995 3.3234 3.5613 1.9485 3.3858 1.4734 1.8124 2.7588 2.9345 3.1380 3.1326 3.2981 3.3380 4.0469 4.2230 2.5684 2.5517 3.4463 2.8261 3.5364 1.1447 4.4018 1.5360 2.3932 5.3761 1.8334 1.6060 3.9192 1.6392 1.7619 2.2406 1.4750 1.5883 1.8842 1.3892 2.3129 1.6643 2.5804 1.3591 4.2623 3.3223 2.3095 2.1980 2.3988 1.7431 1.4141 1.4430 1.1846 1.5582 1.3008 2.0181 1.5948 1.9693 1.8562 1.8381 1.3430 1.3793 1.3439 1.3364 1.2252 1.8766 1.2701 1.2297 2.8577 4.4322 2.2531 1.3711 1.2655 1.3821 1.1164 1.1778 1.0704 1.0901 3.5973 7.5108 5.2044 6.4501 1.0709 1.0677 1.0386 1.0705 1.0979 1.0920 1.0935 1.0926 1.0976 1.0883 1.0867 1.0885 1.0874 1.0940 1.0990 1.1002 1.0636 1.0751 1.0661
irintensity: 0.3414 1.7552 1.8232 4.8147 2.5244 4.4203 3.4058 1.4229 2.0752 3.0186 16.7834 9.2831 19.2389 16.2081 60.2028 28.6857 3.6881 3.5030 7.2865 14.3537 0.8771 8.6768 1.6700 7.1848 38.8953 30.9440 3.2717 55.3449 9.6302 126.9438 6.3928 6.2897 4.7076 0.6155 93.7304 48.6696 6.7493 2.6322 25.0674 11.3273 1.5614 36.8899 8.7710 0.3897 14.6081 19.6016 16.5413 1.3630 96.5549 5.4762 3.8569 41.2574 14.9962 17.4445 51.2187 5.8362 4.4811 4.0093 3.9708 6.1442 26.1049 7.8865 17.9758 11.3403 15.5623 31.7750 5.9679 4.5258 14.9594 2.7639 65.8151 51.3727 1.4320 0.4896 2.3352 3.1717 7.2852 1.1844 14.2190 8.2016 24.8761 6.7386 10.2126 0.7902 4.3147 0.2819 84.0032 46.6616 27.8168 30.1108 22.8189 36.4049 11.6016 13.8967 16.7803 20.9872 2.3518 10.1088 1.8064 36.4625 36.8782 23.7426 91.8673 1.1527 4.9942
temp: 298.150 k
press: 1.00000 atm
elementType: 8 8 7 6 6 6 6 6 6 6 6 6 6 6 6 6 6 6 1 1 1 1 1 1 1 1 1 1 1 1 1 1 1 1 1 1 1
symmnumber: 1
zpe: 808937.2 jmol-1
zpe.correction: 0.308108 hartree
zpe.thermalcorrener: 0.324689 hartree
zpe.thermalcorrenthalpy: 0.325633 hartree
zpe.thermalcorrgfe: 0.263837 hartree
zpe.sumelectzpe: -786.830706 hartree
zpe.sumelectthermal: -786.814125 hartree
zpe.sumelectthermalent: -786.813181 hartree
zpe.sumelectthermalfe: -786.874977 hartree
dipole: -2.3345 3.2274 1.5255
dipole: 4.2653
quadrupole: -111.5976 -101.0322 -111.8151
quadrupole: 10.6445 6.8067 3.4936
quadrupole: -3.4493 7.1161 -3.6668 10.6445 6.8067 3.4936
hfenergy: -787.1388135 hartree
pointgroup: C01 [X(C15H19N1O2)]
dipole: -1.0028322 -0.6340035 -1.1867575 debye
polarizability: 199.9960264|-27.3707871|171.3538733|10.9523796|39.7577721|153.7539824 unknown
InChI: InChI=1S/C15H19NO2/c1-15(10-17,11-18)16-9-13-7-4-6-12-5-2-3-8-14(12)13/h2-8,16-18H,9-11H2,1H3
charge 0 multiplicity 1
37 atoms
O  4.042155 -0.474119 1.75567
O  2.487793 2.333715 -1.268824
N  2.046723 -1.235989 0.119643
C  2.74368 0.027625 -0.285665
C  0.805638 -1.199021 0.937889
C  3.395631 0.604215 1.013346
C  1.794963 1.078864 -0.930513
C  3.850786 -0.38953 -1.282432
C  -0.513704 -0.968709 0.181467
C  -1.445773 0.085107 0.521569
C  -2.672687 0.215274 -0.249855
C  -0.832929 -1.845755 -0.865849
C  -1.224837 1.024369 1.588695
C  -2.941133 -0.699693 -1.319299
C  -2.036886 -1.718183 -1.62065
C  -3.603586 1.259186 0.070905
C  -2.150323 2.029792 1.876934
C  -3.352719 2.152199 1.112336
H  1.997457 -1.917306 -0.646706
H  0.955321 -0.450418 1.731068
H  0.736368 -2.17634 1.455982
H  2.619715 1.105651 1.633659
H  4.160737 1.355477 0.760658
H  1.297922 0.638885 -1.82183
H  1.014634 1.390637 -0.217709
H  4.553285 -1.087025 -0.794156
H  4.439851 0.485866 -1.610432
H  3.423371 -0.879095 -2.179653
H  -0.144797 -2.66572 -1.111236
H  -0.320381 0.955567 2.201208
H  -3.869942 -0.58944 -1.891435
H  -2.246963 -2.424994 -2.430717
H  3.494529 -1.282859 1.507338
H  3.090759 2.173169 -2.037238
H  -4.522132 1.342407 -0.522502
H  -1.955255 2.731901 2.694814
H  -4.069472 2.946092 1.348323
