program: Gaussian 09
title: 000197268
version: EM64L-G09RevD.01
frameworkgroup: C1[X(C20H16O6)]
method: RPBEPBE
basis: SDD
operation: Freq
keyword: #pfreq=noraman
keyword: PBEPBE/SDD
title: #p freq=noraman PBEPBE/SDD
converged: YES YES NO NO
title: Mulliken charges:
elementType: O O O O O O C C C C C C C C C C C C C C C C C C C C H H H H H H H H H H H H H H H H
charge: -0.447411 -0.184838 -0.381736 -0.167808 -0.346961 -0.253092 0.301265 -0.681166 -0.539270 0.516642 0.131278 0.022581 0.184260 -0.756333 0.009750 -0.687517 0.094657 -0.217454 0.060433 0.309102 0.105597 0.215482 -0.424370 -0.354820 -0.203804 -0.515621 0.237412 0.235204 0.243853 0.284115 0.217628 0.247500 0.212168 0.273168 0.331087 0.298176 0.386106 0.265059 0.244263 0.235883 0.281995 0.217537
chargesum: 0.00000
title: Mulliken charges with hydrogens summed into heavy atoms:
elementType: O O O O O O C C C C C C C C C C C C C C C C C C C C
charge: -0.116324 -0.184838 0.004370 -0.167808 -0.346961 -0.253092 0.301265 -0.208550 -0.011302 0.516642 0.131278 0.022581 0.184260 -0.079036 0.009750 -0.414349 0.094657 -0.217454 0.060433 0.309102 0.105597 0.215482 -0.126194 -0.089762 0.040459 0.219794
polarizability: 3.90613491e+02 1.45477749e+01 2.73032132e+02 6.64351670e+00 1.02682454e+00 1.29177046e+02
1716.lowfreq: -8.3430 -5.4302 -1.8991 -0.0009 -0.0006 0.0005 26.6047 40.0701 52.8082
frequency: 26.5775 40.0599 52.7870 64.8815 83.7165 104.7787 121.8809 138.1040 148.9021 161.4981 192.0200 200.1744 229.5490 236.3968 244.3989 257.6840 267.1956 287.6922 295.9658 310.5833 326.2895 329.6585 339.8776 372.0804 383.8769 408.5948 416.5102 424.5784 455.9867 472.0361 476.7463 491.2817 500.9347 520.0999 523.6152 549.8879 572.2661 593.5562 604.1093 625.7909 652.7492 689.3946 705.6116 731.4609 752.1949 764.4753 791.3591 803.3682 819.7197 843.6090 857.0184 871.6742 885.4557 906.5980 921.1609 936.9848 940.3559 960.4129 963.2876 993.4844 1000.5587 1038.3273 1057.0774 1070.7141 1083.0070 1102.1721 1106.3901 1133.6905 1144.1141 1148.7101 1155.2762 1173.6606 1187.4731 1230.6956 1237.1989 1240.6757 1257.1431 1278.5168 1280.9248 1308.8959 1320.8759 1341.9418 1355.0124 1388.7794 1390.0472 1399.3698 1411.0489 1415.0635 1418.0081 1433.7164 1444.3905 1444.8907 1451.8635 1456.5913 1469.1067 1471.1535 1473.0113 1521.3702 1547.6020 1564.5289 1571.2217 1592.6333 1598.3054 1629.2282 2709.5165 2972.5825 2976.5433 2985.4957 3002.6863 3033.8653 3066.5802 3074.9047 3091.2660 3098.7109 3129.7678 3148.0032 3158.3064 3168.3880 3178.7257 3543.3339
redmass: 6.3538 4.1188 4.5891 4.9871 4.9890 4.8882 4.0323 2.6860 1.8580 8.1491 4.8497 5.8872 4.0214 3.8365 1.0709 4.1192 4.4180 1.7413 2.8184 3.7238 3.9037 4.2150 4.5217 4.2027 2.8902 5.8413 6.5003 5.0083 6.8888 6.0603 5.9134 4.7656 3.3239 4.7591 5.2514 5.9860 5.0908 5.7897 5.0174 4.5021 5.0808 5.3525 6.2930 4.0381 7.0285 5.4810 3.2469 2.9399 6.1863 2.7603 2.7841 5.1237 1.8461 2.4907 4.0820 1.7938 1.4633 1.1140 1.6765 5.6662 1.3757 3.7700 3.0960 3.3527 1.7543 2.0030 1.2367 3.1743 1.4386 1.3899 1.4854 1.2469 1.5640 2.7191 3.7531 1.8133 2.7217 3.1556 1.4841 1.7960 6.3910 3.4015 2.2512 2.2601 2.0229 5.0791 2.1366 1.6693 1.4263 3.5356 1.4361 1.3724 1.9561 1.5596 1.0566 1.0828 1.0997 6.0595 8.3788 4.0132 5.1562 7.8195 7.4765 6.5876 1.0705 1.0551 1.0432 1.0320 1.0612 1.0990 1.0987 1.0985 1.0995 1.0999 1.1052 1.0875 1.0923 1.0922 1.0992 1.0657
irintensity: 3.7047 1.2047 1.1220 0.3508 2.0541 1.7276 7.8290 1.0735 0.4443 0.9718 0.4068 0.4033 2.8703 1.5630 0.0985 1.4293 1.9619 74.5051 11.6939 28.5451 65.6342 5.8662 17.7398 6.9691 10.5847 11.7976 4.7349 15.5588 1.3602 11.5853 7.3093 4.3370 0.1745 27.2536 3.1733 4.6247 18.2281 6.6825 0.8887 6.3816 7.5141 1.5344 2.7656 11.9420 19.5977 11.3869 1.4647 60.4796 9.5236 20.9524 3.1155 14.3164 27.2926 1.2684 7.1817 2.0829 6.2795 109.9168 6.0653 49.5701 2.3463 14.4049 36.2504 23.7736 41.7605 21.8669 4.7266 35.3948 15.8976 9.3973 15.9831 5.7431 12.1301 116.9330 75.7804 58.0746 444.3418 258.0621 4.7960 31.1829 225.6281 98.7760 53.1600 32.4495 18.5502 59.7333 33.9905 31.1722 35.7831 115.1810 62.2737 27.5408 31.7961 55.8217 10.0045 17.3257 17.1032 44.9107 102.2913 67.9579 140.5255 146.0076 28.6369 133.7634 288.4901 4.5962 45.6563 43.5784 4.0363 15.9507 23.5251 18.4157 18.5610 23.9079 23.6194 7.9298 3.6239 0.0698 13.8841 3.0860
temp: 298.150 k
press: 1.00000 atm
elementType: 8 8 8 8 8 8 6 6 6 6 6 6 6 6 6 6 6 6 6 6 6 6 6 6 6 6 1 1 1 1 1 1 1 1 1 1 1 1 1 1 1 1
symmnumber: 1
zpe: 821395.8 jmol-1
zpe.correction: 0.312853 hartree
zpe.thermalcorrener: 0.335174 hartree
zpe.thermalcorrenthalpy: 0.336118 hartree
zpe.thermalcorrgfe: 0.262175 hartree
zpe.sumelectzpe: -1221.242357 hartree
zpe.sumelectthermal: -1221.220036 hartree
zpe.sumelectthermalent: -1221.219091 hartree
zpe.sumelectthermalfe: -1221.293035 hartree
dipole: 0.9765 2.3648 1.2613
dipole: 2.8525
quadrupole: -112.2986 -155.6087 -154.5195
quadrupole: 17.5956 -5.6721 6.2383
quadrupole: 28.5103 -14.7998 -13.7106 17.5956 -5.6721 6.2383
hfenergy: -1221.5552097 hartree
pointgroup: C01 [X(C20H16O6)]
dipole: -0.3955938 -0.9261316 0.4952263 debye
polarizability: 390.9535235|13.1230326|272.6979992|-6.558805|-0.8078776|129.1711463 unknown
InChI: InChI=1S/C20H16O6/c1-20(25)7-9-6-11(21)16-17(14(9)12(22)8-20)18(23)10-4-3-5-13(26-2)15(10)19(16)24/h3-6,21,25H,7-8H2,1-2H3
charge 0 multiplicity 1
42 atoms
O  -4.270392 0.093751 -1.570589
O  -2.010756 2.117347 1.734696
O  0.2851 -3.522349 -0.332046
O  -0.212863 2.466378 -0.52518
O  2.44271 -2.249462 -0.483976
O  4.94857 -0.835568 0.283235
C  -4.570437 0.138847 -0.11558
C  -3.918374 -1.086373 0.587526
C  -3.914839 1.455015 0.372586
C  -2.417982 -1.115747 0.356549
C  -1.702402 0.123379 0.397942
C  -2.477474 1.319838 0.875773
C  -0.316509 0.139683 0.114776
C  -6.096717 0.159388 0.095413
C  0.395771 -1.081639 -0.079477
C  -1.739672 -2.315183 0.093224
C  -0.336166 -2.3227 -0.102017
C  0.410208 1.41357 -0.191373
C  1.862156 -1.113464 -0.214695
C  1.91017 1.376913 -0.18693
C  2.632323 0.13558 -0.071268
C  4.066227 0.200578 0.011037
C  2.586239 2.602254 -0.338148
C  4.728011 1.444127 -0.189541
C  3.999447 2.62949 -0.372359
C  4.611048 -1.918849 1.226377
H  -4.380424 -2.024816 0.227058
H  -4.136539 -1.022251 1.67338
H  -4.508624 1.923767 1.176541
H  -3.904801 2.158666 -0.482601
H  -6.358089 0.210264 1.168192
H  -6.532915 1.036967 -0.412471
H  -6.567429 -0.749707 -0.326068
H  -2.271418 -3.27013 0.040842
H  -4.617379 -0.756086 -1.947369
H  1.98872 3.512617 -0.439984
H  1.291246 -3.30589 -0.485081
H  5.821485 1.440883 -0.155801
H  4.529794 3.577627 -0.507029
H  5.577428 -2.221013 1.658561
H  4.131354 -2.749282 0.687504
H  3.935294 -1.546727 2.019169
