program: Gaussian 09
title: 000197204
version: EM64L-G09RevD.01
frameworkgroup: C1[X(C15H20O3)]
method: RPBEPBE
basis: SDD
operation: Freq
keyword: #pfreq=noraman
keyword: PBEPBE/SDD
title: #p freq=noraman PBEPBE/SDD
converged: YES YES NO NO
title: Mulliken charges:
elementType: O O O C C C C C C C C C C C C C C C H H H H H H H H H H H H H H H H H H H H
charge: -0.198094 -0.172340 -0.208333 0.361077 -0.144341 -0.186390 0.412063 -0.655074 -0.310855 -0.337760 -0.498360 -0.629502 -0.473935 0.132353 -0.370836 -0.774380 -0.790811 0.171938 0.267088 0.228640 0.227231 0.227593 0.252129 0.264436 0.232962 0.224056 0.241074 0.266371 0.206472 0.246445 0.267699 0.213765 0.216040 0.215534 0.217622 0.215177 0.215486 0.227760
chargesum: 0.00000
title: Mulliken charges with hydrogens summed into heavy atoms:
elementType: O O O C C C C C C C C C C C C C C C
charge: -0.198094 -0.172340 -0.208333 0.361077 0.122748 0.042249 0.412063 -0.200250 -0.058727 -0.073324 -0.041342 -0.122056 -0.021018 0.132353 0.110628 -0.125184 -0.132387 0.171938
polarizability: 1.68977860e+02 6.70721739e+00 1.59259931e+02 2.16508533e+00 3.20304806e+00 1.30988325e+02
1716.lowfreq: -10.6618 -0.0007 -0.0006 0.0005 8.6246 19.6339 57.6678 89.0831 106.6349
frequency: 57.6501 89.0766 106.5604 139.6656 173.7682 193.5931 199.6484 243.7450 258.9623 274.0513 278.5314 298.9326 335.1135 338.8624 374.9055 383.1822 396.7059 425.3677 442.5313 472.5815 496.8989 520.3910 538.0619 572.8292 607.6193 611.8756 644.1542 664.8064 720.7131 751.0388 769.8105 774.2489 824.2995 831.0091 844.8138 862.4417 895.4692 919.8349 925.0992 935.5616 953.6657 964.8933 981.4092 1000.2946 1012.2485 1030.5305 1045.9497 1054.2664 1069.7744 1075.0293 1084.2981 1096.6297 1120.6852 1130.8843 1143.0970 1159.5191 1171.5155 1189.9603 1207.5372 1210.3668 1213.5045 1232.3321 1241.7473 1246.7526 1261.9729 1272.1407 1277.5989 1280.5002 1291.8239 1306.2210 1324.1150 1342.0530 1348.1478 1360.9176 1371.3493 1381.2599 1402.3549 1432.1815 1456.7151 1465.6378 1468.7804 1473.4620 1475.4302 1479.9269 1488.9290 1496.9507 1659.1898 1664.0024 2949.9977 2975.9363 2978.1583 2981.7908 2986.9803 2988.1650 2989.7048 3008.1683 3009.1522 3012.1518 3014.9792 3035.9040 3044.6627 3057.6885 3064.8533 3067.2048 3078.4562 3093.1460 3097.0003 3100.6277
redmass: 7.4390 6.6618 2.8225 3.0161 2.5974 1.4637 3.1097 1.2474 3.5782 2.4838 2.4863 3.1308 2.2275 2.4529 2.2732 3.0229 5.4747 3.1358 2.8602 3.6090 3.5998 3.7535 4.5164 4.1487 4.3800 3.5811 3.2148 3.1692 3.1771 4.0547 3.3990 2.9124 3.8039 2.3544 2.7081 2.1643 2.0767 2.5566 2.8285 1.6111 1.9833 1.8336 2.2221 1.4546 2.0507 3.2155 2.0331 1.7994 3.8652 2.7043 1.9381 1.7619 2.3499 1.8227 1.6503 1.5081 1.6125 2.2323 1.9063 1.5997 1.6738 1.5316 1.5554 1.7012 1.7858 1.6516 1.7830 1.3487 1.6660 1.6181 1.6341 1.3809 1.3483 1.2844 1.2932 1.1959 1.1978 1.0872 1.0704 1.0593 1.0658 1.0617 1.0783 1.0771 1.0636 1.0569 11.7636 11.6267 1.0809 1.0379 1.0472 1.0555 1.0778 1.0813 1.0648 1.0678 1.0759 1.0706 1.0619 1.1035 1.0990 1.0990 1.0982 1.1018 1.0993 1.0954 1.0951 1.1019
irintensity: 4.8798 3.7560 0.9813 0.3503 0.8083 0.2818 2.1179 0.1634 2.1628 5.3131 0.9565 1.9525 4.2301 0.8595 0.1147 2.6701 0.9230 2.4209 1.4313 9.0728 0.3829 1.4244 1.9458 2.0335 8.8670 3.9950 1.4871 1.2414 1.1815 0.6727 1.6468 6.4452 6.6231 1.3194 14.3306 5.6500 3.0782 5.2328 20.6238 9.6643 9.5602 2.1127 3.1705 1.0803 5.1949 16.8403 19.1002 2.4905 132.7478 26.3366 2.8311 16.5465 11.2567 21.0780 29.5868 2.7013 6.0619 18.6449 12.4922 11.9634 5.1830 0.4195 10.0893 17.5348 3.6478 12.2089 0.9748 6.9506 4.7244 10.4271 9.3404 0.4728 2.2660 0.8181 0.1828 10.5091 16.9688 16.9401 3.9823 9.5193 12.7372 24.7043 12.3989 20.1886 3.4683 3.7859 285.8370 138.1266 19.1469 21.7778 30.9719 45.5318 15.4318 5.9965 20.4422 41.7311 66.9024 25.0474 12.3512 25.3479 36.2398 3.3817 61.7840 18.5368 10.8408 45.0138 33.5212 5.8482
temp: 298.150 k
press: 1.00000 atm
elementType: 8 8 8 6 6 6 6 6 6 6 6 6 6 6 6 6 6 6 1 1 1 1 1 1 1 1 1 1 1 1 1 1 1 1 1 1 1 1
symmnumber: 1
zpe: 844250.7 jmol-1
zpe.correction: 0.321558 hartree
zpe.thermalcorrener: 0.336929 hartree
zpe.thermalcorrenthalpy: 0.337873 hartree
zpe.thermalcorrgfe: 0.280782 hartree
zpe.sumelectzpe: -807.895868 hartree
zpe.sumelectthermal: -807.880496 hartree
zpe.sumelectthermalent: -807.879552 hartree
zpe.sumelectthermalfe: -807.936644 hartree
dipole: -4.9724 0.9977 3.1550
dipole: 5.9727
quadrupole: -118.1376 -123.4242 -102.4248
quadrupole: 0.7108 8.9569 -3.3983
quadrupole: -3.4754 -8.7620 12.2374 0.7108 8.9569 -3.3983
hfenergy: -808.2174256 hartree
pointgroup: C01 [X(C15H20O3)]
dipole: 1.9654902 0.289818 -1.2548691 debye
polarizability: 168.2984413|-7.1818977|159.9479085|1.7731514|-3.3321525|130.9797667 unknown
InChI: InChI=1S/C15H20O3/c1-14(2)7-15-9-4-3-8(14)10(15)5-12(16)11(15)6-18-13(9)17/h8-11H,3-7H2,1-2H3
charge 0 multiplicity 1
38 atoms
O  -2.808317 -0.694224 -0.039617
O  -2.146978 3.023959 0.400231
O  -1.979767 -2.620352 0.863619
C  -0.099804 0.126002 -0.542702
C  0.248473 0.377306 0.969498
C  1.675619 -0.230935 1.040156
C  2.423716 0.291547 -0.248412
C  1.243785 0.442979 -1.287805
C  -0.492737 -1.378209 -0.685669
C  -1.262326 1.093031 -0.880772
C  1.448294 -1.777798 1.027728
C  -0.103992 1.859748 1.228697
C  0.665162 -2.302347 -0.216772
C  -1.283136 2.125981 0.280429
C  -2.611551 0.371108 -1.059439
C  3.123231 1.658335 0.013219
C  3.54738 -0.65698 -0.745749
C  -1.78518 -1.653778 0.102245
H  -0.423874 -0.215448 1.620555
H  2.227388 0.045612 1.959414
H  1.381952 -0.227925 -2.156853
H  1.221119 1.475569 -1.685934
H  -0.713694 -1.593153 -1.754258
H  -1.079709 1.660042 -1.815552
H  0.889372 -2.04726 1.944663
H  2.416496 -2.309239 1.083322
H  0.705243 2.563853 0.962054
H  -0.38919 2.082747 2.270687
H  1.357895 -2.434835 -1.066726
H  0.251193 -3.29982 0.014653
H  -3.455948 1.062062 -0.908224
H  -2.682638 -0.088235 -2.063865
H  3.619526 2.015552 -0.909322
H  2.432562 2.452251 0.340278
H  3.901153 1.553951 0.79306
H  4.050124 -0.216301 -1.627553
H  4.316369 -0.799355 0.037161
H  3.179891 -1.65324 -1.039945
