program: Gaussian 09
title: 000197183
version: EM64L-G09RevD.01
frameworkgroup: C1[X(C15H24O2)]
method: RPBEPBE
basis: SDD
operation: Freq
keyword: #pfreq=noraman
keyword: PBEPBE/SDD
title: #p freq=noraman PBEPBE/SDD
converged: YES YES NO NO
title: Mulliken charges:
elementType: O O C C C C C C C C C C C C C C C H H H H H H H H H H H H H H H H H H H H H H H H
charge: -0.422556 -0.451663 -0.393730 -0.355861 -0.584026 -0.356471 0.180251 -0.356144 0.615742 0.140768 0.179774 -0.540847 -0.596794 -0.658251 -0.363134 -0.695709 -0.686277 0.227974 0.206422 0.182835 0.198477 0.196076 0.271074 0.192479 0.188333 0.194132 0.196146 0.203760 0.195906 0.254658 0.222067 0.208628 0.215766 0.215570 0.210442 0.210107 0.208376 0.211717 0.220286 0.357409 0.356286
chargesum: 0.00000
title: Mulliken charges with hydrogens summed into heavy atoms:
elementType: O O C C C C C C C C C C C C C C C
charge: -0.065147 -0.095376 0.040665 0.025451 -0.116876 0.024341 0.180251 0.034134 0.615742 0.140768 0.179774 -0.141181 -0.342136 -0.436184 0.061260 -0.059590 -0.045898
polarizability: 2.33515339e+02 -7.14462946e+00 1.52172873e+02 -1.27476007e+01 -1.67191203e+01 1.36797757e+02
1716.lowfreq: -18.8469 -5.9641 -0.0005 0.0002 0.0005 0.8231 10.3192 19.3043 24.6701
frequency: -12.5505 18.1884 24.6519 51.4322 66.0376 75.1699 76.5646 115.0791 117.7824 137.4455 154.3678 223.3416 228.0225 231.0751 243.2385 256.7724 274.9126 282.6577 308.9102 318.8827 334.3246 346.1139 356.8903 426.1374 454.6228 502.9315 515.7082 562.9339 579.6216 591.8966 668.4347 724.9519 727.0310 735.0155 743.0132 782.7521 786.2053 822.3298 859.5508 864.5617 874.2456 887.8006 889.6621 951.4195 977.2145 994.3679 1009.4958 1010.5061 1050.5696 1064.7492 1078.4118 1079.4829 1091.8501 1094.0125 1114.4374 1132.2755 1144.5784 1177.5051 1195.0269 1219.7220 1224.5521 1230.0647 1241.4494 1263.3075 1274.2285 1277.5891 1282.4910 1286.6215 1290.9702 1296.3792 1323.6794 1330.6777 1338.8003 1347.2466 1353.5502 1388.0431 1389.1960 1403.9661 1434.7716 1462.4982 1463.9599 1468.2649 1473.0288 1476.2260 1477.0733 1478.2452 1479.8004 1487.4006 1488.0493 1493.1410 1512.0586 1596.1932 1639.6089 2931.7925 2949.3051 2955.2316 2964.2700 2967.7783 2970.6970 2972.2810 2973.1570 2983.8050 2988.4260 3003.7898 3016.8653 3024.9641 3039.0790 3042.1901 3064.0395 3069.2486 3070.3999 3071.2128 3072.5510 3106.2286 3156.3199 3575.6741 3588.3270
redmass: 2.5060 4.6362 3.9228 1.5757 2.6514 2.2525 3.7981 2.5711 2.3181 2.2346 4.5019 4.0091 3.4936 1.1290 1.0919 4.0652 2.5241 3.3322 1.6743 2.2908 2.0319 1.4007 2.5811 3.0741 4.0857 4.6027 5.0439 3.7598 4.8837 4.5960 3.8394 1.2082 2.4983 1.1090 1.0998 1.9282 1.6048 1.8482 1.3813 1.5275 1.2578 1.8846 1.8163 1.8810 4.3407 1.5262 4.1832 3.4049 2.8721 2.8500 1.3725 2.2454 1.5659 2.0485 2.4049 2.4244 1.3605 1.3461 1.6249 1.4088 1.4375 1.5822 1.3938 1.3982 1.3256 1.2081 1.1625 1.1246 1.2180 1.1132 1.7959 1.7006 2.2253 1.4922 1.6594 1.2137 1.2170 4.7757 3.5742 1.0684 1.0780 1.0824 1.0773 1.0604 1.0443 1.0430 1.0816 1.0834 1.0869 1.1018 3.5788 6.6512 7.2061 1.0703 1.0592 1.0590 1.0627 1.0612 1.0430 1.0363 1.0515 1.0604 1.0952 1.0992 1.0997 1.1008 1.1010 1.1032 1.0926 1.1006 1.1013 1.0993 1.0994 1.0911 1.0921 1.0652 1.0660
irintensity: 0.0841 0.1905 0.0654 0.0015 0.0397 0.0828 0.2278 0.0452 0.1432 0.0414 0.1256 1.0876 2.2058 0.1154 0.0007 3.6646 0.9926 2.3405 16.5298 2.6573 79.4420 150.8827 10.6998 0.7775 4.0246 3.1007 1.4065 5.3603 7.0627 0.7884 13.4009 6.4176 7.5029 0.6194 4.2260 5.5745 5.0454 27.3904 12.8255 16.0622 0.0166 5.7546 0.7534 29.9415 19.1573 57.5245 1.5566 3.5772 2.4777 1.2115 9.3582 0.3446 120.9742 32.0292 13.1393 13.7784 96.1793 18.9006 3.0364 2.1093 44.5627 38.2546 0.3177 20.5300 2.3165 1.8003 0.6428 3.7283 6.9803 2.4824 7.9634 8.6464 6.2385 1.1684 0.6099 10.6553 11.2017 4.9417 48.3830 0.0635 0.4186 0.2784 0.5724 1.2367 9.7551 12.5165 3.2121 4.5114 17.2766 29.5032 34.5872 111.4146 79.0965 35.9811 11.6732 6.3373 1.3868 123.3066 15.9107 43.4272 44.4489 54.5296 6.0934 2.4981 1.4312 7.4144 74.9055 11.3767 14.7340 90.6548 79.1523 56.0474 49.8396 16.7919 4.0339 28.6854 27.8101
temp: 298.150 k
press: 1.00000 atm
elementType: 8 8 6 6 6 6 6 6 6 6 6 6 6 6 6 6 6 1 1 1 1 1 1 1 1 1 1 1 1 1 1 1 1 1 1 1 1 1 1 1 1
symmnumber: 1
zpe: 934030.2 jmol-1
zpe.correction: 0.355753 hartree
zpe.thermalcorrener: 0.374923 hartree
zpe.thermalcorrenthalpy: 0.375868 hartree
zpe.thermalcorrgfe: 0.306567 hartree
zpe.sumelectzpe: -735.110774 hartree
zpe.sumelectthermal: -735.091604 hartree
zpe.sumelectthermalent: -735.090660 hartree
zpe.sumelectthermalfe: -735.159961 hartree
dipole: 0.0809 1.2776 -1.3193
dipole: 1.8383
quadrupole: -96.2575 -103.5758 -106.2541
quadrupole: 3.8060 -6.7968 -3.4310
quadrupole: 5.7716 -1.5466 -4.2250 3.8060 -6.7968 -3.4310
hfenergy: -735.4665277 hartree
pointgroup: C01 [X(C15H24O2)]
dipole: -0.0251432 0.7213867 -0.0454996 debye
polarizability: 233.3609201|-5.7711948|159.8849795|-14.0026172|-10.0869732|129.2400696 unknown
InChI: InChI=1S/C15H24O2/c1-3-5-6-7-9-13-14(16)10-12(8-4-2)11-15(13)17/h10-11,16-17H,3-9H2,1-2H3
charge 0 multiplicity 1
41 atoms
O  -0.15978 -2.470482 -0.308859
O  -0.305476 2.243499 -1.514531
C  2.214171 0.026275 -0.018871
C  3.717686 -0.017336 -0.368904
C  1.300139 -0.085235 -1.273506
C  4.633427 0.101094 0.869885
C  -0.18079 -0.085406 -0.935523
C  6.139694 0.056976 0.524082
C  -2.981018 -0.074657 -0.257695
C  -0.845691 -1.249661 -0.464652
C  -0.970667 1.085771 -1.049591
C  -4.448278 -0.053599 0.144877
C  -2.21792 -1.257033 -0.132421
C  -2.345477 1.104166 -0.722593
C  -4.655018 0.313708 1.641952
C  7.04689 0.173383 1.767933
C  -6.145005 0.337574 2.043054
H  1.980913 0.978561 0.495719
H  1.976834 -0.780051 0.705947
H  3.948677 -0.963106 -0.904713
H  3.95077 0.804675 -1.077351
H  1.574677 -0.996108 -1.852061
H  1.513039 0.76899 -1.938664
H  4.4090 1.048521 1.403023
H  4.398248 -0.717961 1.581667
H  6.363077 -0.889033 -0.010649
H  6.374472 0.877013 -0.185056
H  -4.905335 -1.045213 -0.041078
H  -5.003913 0.676441 -0.476934
H  -2.670571 -2.19014 0.217117
H  -2.927337 2.029949 -0.829469
H  -4.195058 1.302349 1.83804
H  -4.10541 -0.414484 2.269745
H  8.117563 0.137509 1.494417
H  6.866386 1.125205 2.302605
H  6.85161 -0.651488 2.479104
H  -6.708162 1.07545 1.440421
H  -6.615889 -0.651413 1.886634
H  -6.26974 0.60566 3.108204
H  0.787547 -2.370432 -0.576723
H  -0.940879 2.997767 -1.584284
