program: Gaussian 09
title: 000189243
version: EM64L-G09RevD.01
frameworkgroup: C1[X(C6H11ClS2)]
method: RPBEPBE
basis: SDD
operation: Freq
keyword: #p
keyword: freq=noraman
keyword: PBEPBE/SDD
title: #p freq=noraman PBEPBE/SDD
converged: YES YES NO NO
title: Mulliken charges:
elementType: Cl S S C C C C C C H H H H H H H H H H H
charge: -0.073571 0.175352 0.174853 -0.641541 -0.583896 -0.604930 -0.517313 -0.298494 -0.492757 0.275554 0.260660 0.272378 0.268341 0.281481 0.269208 0.280061 0.267932 0.233133 0.222178 0.231372
chargesum: 0.00000
title: Mulliken charges with hydrogens summed into heavy atoms:
elementType: Cl S S C C C C C C
charge: -0.073571 0.175352 0.174853 -0.105327 -0.043177 -0.054241 0.030679 -0.065362 -0.039207
polarizability: 1.68747632e+02 9.66017284e+00 1.00566920e+02 5.23699439e-01 -6.73052920e-01 7.91313403e+01
1716.lowfreq: -10.2178 -5.1067 0.0029 0.0032 0.0036 8.2155 16.8778 29.7211 48.5280
frequency: 12.4865 29.5749 48.5221 80.6039 85.9882 98.5376 109.0777 189.3912 211.2508 258.8631 279.7390 307.8137 391.2885 578.4102 628.5341 646.1435 660.5177 681.1260 716.9963 749.4355 766.6784 899.1489 929.2862 946.2160 975.7481 1021.8667 1057.1201 1064.3366 1098.0162 1122.5631 1210.8259 1227.5802 1258.4673 1263.5491 1272.7039 1281.8116 1291.2301 1390.9915 1442.3405 1451.8579 1455.3221 1457.3668 1602.2206 3022.4289 3032.1464 3046.4008 3067.9330 3089.9674 3099.0106 3114.7143 3118.0338 3129.0063 3157.8636 3211.0415
redmass: 5.1858 6.6173 2.2910 2.6388 2.1213 2.7414 3.6508 4.6601 4.9764 4.2728 8.3229 4.3170 3.6471 1.5016 8.2239 6.7454 4.7795 5.1739 4.6954 1.1348 1.1570 1.3808 1.3290 1.0766 1.4117 1.4608 3.9240 4.6408 1.0356 1.0842 1.1516 1.1430 1.1915 1.1951 1.1570 1.1885 1.2208 1.1946 1.0931 1.0960 1.0911 1.0913 4.2007 1.0577 1.0577 1.0591 1.0566 1.1065 1.0585 1.1083 1.1071 1.0966 1.1118 1.1152
irintensity: 0.4957 1.0143 1.2490 0.6182 2.5217 2.8815 0.6614 5.6394 9.1746 5.9038 1.1194 0.2421 2.8914 19.3232 80.6068 26.2832 46.4034 1.3145 1.0885 5.3346 8.4366 55.1924 0.8117 64.4625 2.7635 23.4173 1.6442 3.9326 1.5379 4.5312 22.1721 4.6492 3.7678 4.6742 1.4926 9.6411 0.8041 7.4712 4.8794 0.6845 20.0172 6.8724 81.8064 5.7193 20.0052 5.8809 14.1926 2.5076 2.5904 16.8611 1.5864 9.4815 12.0367 12.9548
temp: 298.150 k
press: 1.00000 atm
elementType: 17 16 16 6 6 6 6 6 6 1 1 1 1 1 1 1 1 1 1 1
symmnumber: 1
zpe: 408764.5 jmol-1
zpe.correction: 0.155690 hartree
zpe.thermalcorrener: 0.168363 hartree
zpe.thermalcorrenthalpy: 0.169307 hartree
zpe.thermalcorrgfe: 0.112222 hartree
zpe.sumelectzpe: -1490.656603 hartree
zpe.sumelectthermal: -1490.643930 hartree
zpe.sumelectthermalent: -1490.642986 hartree
zpe.sumelectthermalfe: -1490.700070 hartree
dipole: -1.1902 1.0936 -0.6446
dipole: 1.7401
quadrupole: -83.6011 -83.1789 -76.0657
quadrupole: 5.1940 5.0218 -0.1506
quadrupole: -2.6525 -2.2304 4.8828 5.1940 5.0218 -0.1506
hfenergy: -1490.8122927 hartree
pointgroup: C01 [X(C6H11Cl1S2)]
dipole: -0.3850264 -0.5285599 -0.2026356 debye
dipolederiv: -0.4086228 -0.1731039 -0.1735044 -0.2897462 -0.3882502 -0.2150937 -0.3331356 -0.2519929 -0.4701622 -0.5548837 -0.1491264 -0.0621356 -0.1811437 -0.1525969 -0.010514 -0.0605543 0.0227559 -0.1369084 -0.6670011 -0.0298647 0.140676 -0.244599 -0.0553509 0.0148054 0.3237395 -0.0631415 -0.1371281 0.3981728 -0.0403601 0.0595315 0.0374408 0.0339889 -0.0660144 -0.0431773 -0.0283813 0.0803775 0.4594686 -0.1413256 0.0680885 -0.224591 0.0830361 0.1018589 0.0027234 0.0734716 0.064794 0.157977 0.0829361 0.127966 0.1267455 0.0717436 0.0508638 0.1098111 -0.0032727 0.0871319 0.4221167 0.1814887 0.2639249 0.3145204 0.3867993 0.3183849 0.3191113 0.2916179 0.4957332 0.6931791 0.1522545 -0.3913991 0.4281213 0.0898708 -0.0981074 -0.5259314 -0.0571893 -0.0307645 -0.5925215 -0.0029687 0.0260445 -0.0428291 0.0665123 -0.0636605 0.0585995 -0.0508964 -0.4093601 0.0237942 0.0133804 -0.0715934 0.0188082 0.0931015 0.0048969 -0.0046764 0.0041733 -0.0611506 -0.0016448 0.0039937 -0.010522 -0.0222534 -0.0955098 0.0011129 0.0036009 -0.0437983 0.0823054 -0.0346039 0.0465127 -0.0623973 0.0730108 0.0450925 0.0092911 -0.0710541 0.0154493 -0.0933191 -0.0224308 -0.0059158 -0.0066908 -0.0061436 -0.0981018 -0.0262695 -0.0255481 -0.028311 0.0682507 0.0196482 0.042812 -0.0760091 -0.0054644 -0.0008286 0.0285876 -0.0654852 0.0585196 0.0299217 -0.027825 -0.0056587 0.053646 0.0075454 0.0406321 -0.0753368 0.0742884 -0.0292841 -0.008038 -0.038271 -0.0133601 0.016736 0.0365103 0.0481538 -0.0828283 0.0457301 -0.0544795 -0.0176026 0.0412682 0.0618164 -0.09676 0.024242 -0.0251327 0.0091266 -0.0684061 0.039504 -0.0301774 0.038812 0.0396545 0.0614085 -0.0302394 -0.1023073 0.0420602 0.1358452 0.0263584 0.1318855 -0.0364353 -0.0759164 0.0952276 -0.0542998 0.0289972 0.042292 0.0963393 0.0388553 0.1743903 0.1298031 0.0127516 0.0377623 0.034365 -0.0698501 0.0145446 0.0281799 0.0400417 0.1798205 unknown
polarizability: 169.8050874|0.8606292|89.5303337|4.5957712|10.1361262|89.1104711 unknown
InChI: InChI=1S/C6H11ClS2/c1-2-8-5-6-9-4-3-7/h2H,1,3-6H2
charge 0 multiplicity 1
20 atoms
Cl 4.099919 1.823731 1.774156
S  1.817884 -0.980708 -0.977482
S  -2.386145 0.778353 -0.782374
C  0.292781 0.11117 -1.277933
C  -0.900887 -0.372528 -0.452457
C  2.504556 -0.154158 0.590041
C  3.430983 0.99008 0.198101
C  -3.699606 -0.217068 -0.001377
C  -4.880614 0.297212 0.420063
H  0.091735 0.043161 -2.359837
H  0.565058 1.153912 -1.039961
H  -0.684814 -0.352499 0.62871
H  -1.191981 -1.394475 -0.748619
H  3.042571 -0.942243 1.139941
H  1.659421 0.193046 1.206021
H  4.317566 0.645031 -0.352162
H  2.916617 1.788569 -0.356971
H  -3.483348 -1.291576 0.054188
H  -5.6578 -0.36421 0.817937
H  -5.106894 1.367799 0.376612
